{"text_format":"1","workbook":"xlsx","n_sheets":7,"sheets":["Overlay","DataTable","GraphData","Data1","Data2","Data3","Data4"],"not_rendered":{"charts":1,"images":1,"macros":1,"external_links":0,"defined_names":28,"comments":0,"pivot_tables":0},"unopened":[],"bounds":{"document_bytes":16777216,"sheet_cells":100000,"rows_first":2000,"rows_last":500,"rows_between":2000,"halvings":0,"cell_chars":16384,"cell_head_chars":4096},"cells_cut":0,"cells_raw":0,"read":"whole","date_system":"1900"}

{"sheet":"Overlay","index":0,"n_rows":16,"n_cols":4,"rows_kept":16,"cut":false,"hidden":false,"merged":[[7,1,7,4],[13,0,13,1],[13,2,13,4],[14,0,14,4],[8,2,8,4],[9,2,9,4],[10,2,10,4],[11,2,11,4],[2,1,2,4],[1,1,1,4],[4,3,4,4],[5,3,5,4],[4,1,4,2],[5,1,5,2]]}
[]
[null,"TOUCHSCREEN MODEL"]
[null,"GRAPH OVERLAY"]
[]
[null,"Distance - X",null,"Load - Y"]
[]
[]
[null,"LEGEND"]
[null,"1    ¯",{"$f":"TestName1","v":""}]
[null,"2 o",{"$f":"TestName2","v":""}]
[null,"3    ¡",{"$f":"TestName3","v":""}]
[null,"4    r",{"$f":"TestName4","v":""}]
[]
["NOTES"]
[""]
[2.1,"TS"]

{"sheet":"DataTable","index":1,"n_rows":54,"n_cols":20,"rows_kept":54,"cut":false,"hidden":false,"merged":[[1,17,1,19],[1,2,1,4],[1,7,1,9],[1,12,1,14]]}
[""]
[null,"¯","",null,null,null,"o","",null,null,null,"¡","",null,null,null,"r",""]
[null,"Center","Travel",{"$f":"IF(Data1!testType=\"COMP+REB\", \"Up\", \"Wheel\")","v":"Wheel"},{"$f":"IF(Data1!testType=\"COMP+REB\", \"Down\", \"Offset\")","v":"Offset"},null,"Center","Travel",{"$f":"IF(Data2!testType=\"COMP+REB\", \"Up\", \"Wheel\")","v":"Wheel"},{"$f":"IF(Data2!testType=\"COMP+REB\", \"Down\", \"Offset\")","v":"Offset"},null,"Center","Travel",{"$f":"IF(Data3!testType=\"COMP+REB\", \"Up\", \"Wheel\")","v":"Wheel"},{"$f":"IF(Data3!testType=\"COMP+REB\", \"Down\", \"Offset\")","v":"Offset"},null,"Center","Travel",{"$f":"IF(Data4!testType=\"COMP+REB\", \"Up\", \"Wheel\")","v":"Wheel"},{"$f":"IF(Data4!testType=\"COMP+REB\", \"Down\", \"Offset\")","v":"Offset"}]
[null,"Distance","Distance","Load","Load",null,"Distance","Distance","Load","Load",null,"Distance","Distance","Load","Load",null,"Distance","Distance","Load","Load"]
[1,{"$f":"IF(ISBLANK(Data1!$A2),\"\",Data1!$A2)","v":""},{"$f":"IF(ISBLANK(Data1!$B2),\"\",Data1!$B2)","v":""},{"$f":"IF(ISBLANK(Data1!$C2),\"\",Data1!$C2)","v":""},{"$f":"IF(ISBLANK(Data1!$D2),\"\",Data1!$D2)","v":""},null,{"$f":"IF(ISBLANK(Data2!$A2),\"\",Data2!$A2)","v":""},{"$f":"IF(ISBLANK(Data2!$B2),\"\",Data2!$B2)","v":""},{"$f":"IF(ISBLANK(Data2!$C2),\"\",Data2!$C2)","v":""},{"$f":"IF(ISBLANK(Data2!$D2),\"\",Data2!$D2)","v":""},null,{"$f":"IF(ISBLANK(Data3!$A2),\"\",Data3!$A2)","v":""},{"$f":"IF(ISBLANK(Data3!$B2),\"\",Data3!$B2)","v":""},{"$f":"IF(ISBLANK(Data3!$C2),\"\",Data3!$C2)","v":""},{"$f":"IF(ISBLANK(Data3!$D2),\"\",Data3!$D2)","v":""},null,{"$f":"IF(ISBLANK(Data4!$A2),\"\",Data4!$A2)","v":""},{"$f":"IF(ISBLANK(Data4!$B2),\"\",Data4!$B2)","v":""},{"$f":"IF(ISBLANK(Data4!$C2),\"\",Data4!$C2)","v":""},{"$f":"IF(ISBLANK(Data4!$D2),\"\",Data4!$D2)","v":""}]
[{"$f":"A5+1","v":2},{"$f":"IF(ISBLANK(Data1!$A3),\"\",Data1!$A3)","v":""},{"$f":"IF(ISBLANK(Data1!$B3),\"\",Data1!$B3)","v":""},{"$f":"IF(ISBLANK(Data1!$C3),\"\",Data1!$C3)","v":""},{"$f":"IF(ISBLANK(Data1!$D3),\"\",Data1!$D3)","v":""},null,{"$f":"IF(ISBLANK(Data2!$A3),\"\",Data2!$A3)","v":""},{"$f":"IF(ISBLANK(Data2!$B3),\"\",Data2!$B3)","v":""},{"$f":"IF(ISBLANK(Data2!$C3),\"\",Data2!$C3)","v":""},{"$f":"IF(ISBLANK(Data2!$D3),\"\",Data2!$D3)","v":""},null,{"$f":"IF(ISBLANK(Data3!$A3),\"\",Data3!$A3)","v":""},{"$f":"IF(ISBLANK(Data3!$B3),\"\",Data3!$B3)","v":""},{"$f":"IF(ISBLANK(Data3!$C3),\"\",Data3!$C3)","v":""},{"$f":"IF(ISBLANK(Data3!$D3),\"\",Data3!$D3)","v":""},null,{"$f":"IF(ISBLANK(Data4!$A3),\"\",Data4!$A3)","v":""},{"$f":"IF(ISBLANK(Data4!$B3),\"\",Data4!$B3)","v":""},{"$f":"IF(ISBLANK(Data4!$C3),\"\",Data4!$C3)","v":""},{"$f":"IF(ISBLANK(Data4!$D3),\"\",Data4!$D3)","v":""}]
[3,{"$f":"IF(ISBLANK(Data1!$A4),\"\",Data1!$A4)","v":""},{"$f":"IF(ISBLANK(Data1!$B4),\"\",Data1!$B4)","v":""},{"$f":"IF(ISBLANK(Data1!$C4),\"\",Data1!$C4)","v":""},{"$f":"IF(ISBLANK(Data1!$D4),\"\",Data1!$D4)","v":""},null,{"$f":"IF(ISBLANK(Data2!$A4),\"\",Data2!$A4)","v":""},{"$f":"IF(ISBLANK(Data2!$B4),\"\",Data2!$B4)","v":""},{"$f":"IF(ISBLANK(Data2!$C4),\"\",Data2!$C4)","v":""},{"$f":"IF(ISBLANK(Data2!$D4),\"\",Data2!$D4)","v":""},null,{"$f":"IF(ISBLANK(Data3!$A4),\"\",Data3!$A4)","v":""},{"$f":"IF(ISBLANK(Data3!$B4),\"\",Data3!$B4)","v":""},{"$f":"IF(ISBLANK(Data3!$C4),\"\",Data3!$C4)","v":""},{"$f":"IF(ISBLANK(Data3!$D4),\"\",Data3!$D4)","v":""},null,{"$f":"IF(ISBLANK(Data4!$A4),\"\",Data4!$A4)","v":""},{"$f":"IF(ISBLANK(Data4!$B4),\"\",Data4!$B4)","v":""},{"$f":"IF(ISBLANK(Data4!$C4),\"\",Data4!$C4)","v":""},{"$f":"IF(ISBLANK(Data4!$D4),\"\",Data4!$D4)","v":""}]
[4,{"$f":"IF(ISBLANK(Data1!$A5),\"\",Data1!$A5)","v":""},{"$f":"IF(ISBLANK(Data1!$B5),\"\",Data1!$B5)","v":""},{"$f":"IF(ISBLANK(Data1!$C5),\"\",Data1!$C5)","v":""},{"$f":"IF(ISBLANK(Data1!$D5),\"\",Data1!$D5)","v":""},null,{"$f":"IF(ISBLANK(Data2!$A5),\"\",Data2!$A5)","v":""},{"$f":"IF(ISBLANK(Data2!$B5),\"\",Data2!$B5)","v":""},{"$f":"IF(ISBLANK(Data2!$C5),\"\",Data2!$C5)","v":""},{"$f":"IF(ISBLANK(Data2!$D5),\"\",Data2!$D5)","v":""},null,{"$f":"IF(ISBLANK(Data3!$A5),\"\",Data3!$A5)","v":""},{"$f":"IF(ISBLANK(Data3!$B5),\"\",Data3!$B5)","v":""},{"$f":"IF(ISBLANK(Data3!$C5),\"\",Data3!$C5)","v":""},{"$f":"IF(ISBLANK(Data3!$D5),\"\",Data3!$D5)","v":""},null,{"$f":"IF(ISBLANK(Data4!$A5),\"\",Data4!$A5)","v":""},{"$f":"IF(ISBLANK(Data4!$B5),\"\",Data4!$B5)","v":""},{"$f":"IF(ISBLANK(Data4!$C5),\"\",Data4!$C5)","v":""},{"$f":"IF(ISBLANK(Data4!$D5),\"\",Data4!$D5)","v":""}]
[5,{"$f":"IF(ISBLANK(Data1!$A6),\"\",Data1!$A6)","v":""},{"$f":"IF(ISBLANK(Data1!$B6),\"\",Data1!$B6)","v":""},{"$f":"IF(ISBLANK(Data1!$C6),\"\",Data1!$C6)","v":""},{"$f":"IF(ISBLANK(Data1!$D6),\"\",Data1!$D6)","v":""},null,{"$f":"IF(ISBLANK(Data2!$A6),\"\",Data2!$A6)","v":""},{"$f":"IF(ISBLANK(Data2!$B6),\"\",Data2!$B6)","v":""},{"$f":"IF(ISBLANK(Data2!$C6),\"\",Data2!$C6)","v":""},{"$f":"IF(ISBLANK(Data2!$D6),\"\",Data2!$D6)","v":""},null,{"$f":"IF(ISBLANK(Data3!$A6),\"\",Data3!$A6)","v":""},{"$f":"IF(ISBLANK(Data3!$B6),\"\",Data3!$B6)","v":""},{"$f":"IF(ISBLANK(Data3!$C6),\"\",Data3!$C6)","v":""},{"$f":"IF(ISBLANK(Data3!$D6),\"\",Data3!$D6)","v":""},null,{"$f":"IF(ISBLANK(Data4!$A6),\"\",Data4!$A6)","v":""},{"$f":"IF(ISBLANK(Data4!$B6),\"\",Data4!$B6)","v":""},{"$f":"IF(ISBLANK(Data4!$C6),\"\",Data4!$C6)","v":""},{"$f":"IF(ISBLANK(Data4!$D6),\"\",Data4!$D6)","v":""}]
[6,{"$f":"IF(ISBLANK(Data1!$A7),\"\",Data1!$A7)","v":""},{"$f":"IF(ISBLANK(Data1!$B7),\"\",Data1!$B7)","v":""},{"$f":"IF(ISBLANK(Data1!$C7),\"\",Data1!$C7)","v":""},{"$f":"IF(ISBLANK(Data1!$D7),\"\",Data1!$D7)","v":""},null,{"$f":"IF(ISBLANK(Data2!$A7),\"\",Data2!$A7)","v":""},{"$f":"IF(ISBLANK(Data2!$B7),\"\",Data2!$B7)","v":""},{"$f":"IF(ISBLANK(Data2!$C7),\"\",Data2!$C7)","v":""},{"$f":"IF(ISBLANK(Data2!$D7),\"\",Data2!$D7)","v":""},null,{"$f":"IF(ISBLANK(Data3!$A7),\"\",Data3!$A7)","v":""},{"$f":"IF(ISBLANK(Data3!$B7),\"\",Data3!$B7)","v":""},{"$f":"IF(ISBLANK(Data3!$C7),\"\",Data3!$C7)","v":""},{"$f":"IF(ISBLANK(Data3!$D7),\"\",Data3!$D7)","v":""},null,{"$f":"IF(ISBLANK(Data4!$A7),\"\",Data4!$A7)","v":""},{"$f":"IF(ISBLANK(Data4!$B7),\"\",Data4!$B7)","v":""},{"$f":"IF(ISBLANK(Data4!$C7),\"\",Data4!$C7)","v":""},{"$f":"IF(ISBLANK(Data4!$D7),\"\",Data4!$D7)","v":""}]
[7,{"$f":"IF(ISBLANK(Data1!$A8),\"\",Data1!$A8)","v":""},{"$f":"IF(ISBLANK(Data1!$B8),\"\",Data1!$B8)","v":""},{"$f":"IF(ISBLANK(Data1!$C8),\"\",Data1!$C8)","v":""},{"$f":"IF(ISBLANK(Data1!$D8),\"\",Data1!$D8)","v":""},null,{"$f":"IF(ISBLANK(Data2!$A8),\"\",Data2!$A8)","v":""},{"$f":"IF(ISBLANK(Data2!$B8),\"\",Data2!$B8)","v":""},{"$f":"IF(ISBLANK(Data2!$C8),\"\",Data2!$C8)","v":""},{"$f":"IF(ISBLANK(Data2!$D8),\"\",Data2!$D8)","v":""},null,{"$f":"IF(ISBLANK(Data3!$A8),\"\",Data3!$A8)","v":""},{"$f":"IF(ISBLANK(Data3!$B8),\"\",Data3!$B8)","v":""},{"$f":"IF(ISBLANK(Data3!$C8),\"\",Data3!$C8)","v":""},{"$f":"IF(ISBLANK(Data3!$D8),\"\",Data3!$D8)","v":""},null,{"$f":"IF(ISBLANK(Data4!$A8),\"\",Data4!$A8)","v":""},{"$f":"IF(ISBLANK(Data4!$B8),\"\",Data4!$B8)","v":""},{"$f":"IF(ISBLANK(Data4!$C8),\"\",Data4!$C8)","v":""},{"$f":"IF(ISBLANK(Data4!$D8),\"\",Data4!$D8)","v":""}]
[8,{"$f":"IF(ISBLANK(Data1!$A9),\"\",Data1!$A9)","v":""},{"$f":"IF(ISBLANK(Data1!$B9),\"\",Data1!$B9)","v":""},{"$f":"IF(ISBLANK(Data1!$C9),\"\",Data1!$C9)","v":""},{"$f":"IF(ISBLANK(Data1!$D9),\"\",Data1!$D9)","v":""},null,{"$f":"IF(ISBLANK(Data2!$A9),\"\",Data2!$A9)","v":""},{"$f":"IF(ISBLANK(Data2!$B9),\"\",Data2!$B9)","v":""},{"$f":"IF(ISBLANK(Data2!$C9),\"\",Data2!$C9)","v":""},{"$f":"IF(ISBLANK(Data2!$D9),\"\",Data2!$D9)","v":""},null,{"$f":"IF(ISBLANK(Data3!$A9),\"\",Data3!$A9)","v":""},{"$f":"IF(ISBLANK(Data3!$B9),\"\",Data3!$B9)","v":""},{"$f":"IF(ISBLANK(Data3!$C9),\"\",Data3!$C9)","v":""},{"$f":"IF(ISBLANK(Data3!$D9),\"\",Data3!$D9)","v":""},null,{"$f":"IF(ISBLANK(Data4!$A9),\"\",Data4!$A9)","v":""},{"$f":"IF(ISBLANK(Data4!$B9),\"\",Data4!$B9)","v":""},{"$f":"IF(ISBLANK(Data4!$C9),\"\",Data4!$C9)","v":""},{"$f":"IF(ISBLANK(Data4!$D9),\"\",Data4!$D9)","v":""}]
[9,{"$f":"IF(ISBLANK(Data1!$A10),\"\",Data1!$A10)","v":""},{"$f":"IF(ISBLANK(Data1!$B10),\"\",Data1!$B10)","v":""},{"$f":"IF(ISBLANK(Data1!$C10),\"\",Data1!$C10)","v":""},{"$f":"IF(ISBLANK(Data1!$D10),\"\",Data1!$D10)","v":""},null,{"$f":"IF(ISBLANK(Data2!$A10),\"\",Data2!$A10)","v":""},{"$f":"IF(ISBLANK(Data2!$B10),\"\",Data2!$B10)","v":""},{"$f":"IF(ISBLANK(Data2!$C10),\"\",Data2!$C10)","v":""},{"$f":"IF(ISBLANK(Data2!$D10),\"\",Data2!$D10)","v":""},null,{"$f":"IF(ISBLANK(Data3!$A10),\"\",Data3!$A10)","v":""},{"$f":"IF(ISBLANK(Data3!$B10),\"\",Data3!$B10)","v":""},{"$f":"IF(ISBLANK(Data3!$C10),\"\",Data3!$C10)","v":""},{"$f":"IF(ISBLANK(Data3!$D10),\"\",Data3!$D10)","v":""},null,{"$f":"IF(ISBLANK(Data4!$A10),\"\",Data4!$A10)","v":""},{"$f":"IF(ISBLANK(Data4!$B10),\"\",Data4!$B10)","v":""},{"$f":"IF(ISBLANK(Data4!$C10),\"\",Data4!$C10)","v":""},{"$f":"IF(ISBLANK(Data4!$D10),\"\",Data4!$D10)","v":""}]
[10,{"$f":"IF(ISBLANK(Data1!$A11),\"\",Data1!$A11)","v":""},{"$f":"IF(ISBLANK(Data1!$B11),\"\",Data1!$B11)","v":""},{"$f":"IF(ISBLANK(Data1!$C11),\"\",Data1!$C11)","v":""},{"$f":"IF(ISBLANK(Data1!$D11),\"\",Data1!$D11)","v":""},null,{"$f":"IF(ISBLANK(Data2!$A11),\"\",Data2!$A11)","v":""},{"$f":"IF(ISBLANK(Data2!$B11),\"\",Data2!$B11)","v":""},{"$f":"IF(ISBLANK(Data2!$C11),\"\",Data2!$C11)","v":""},{"$f":"IF(ISBLANK(Data2!$D11),\"\",Data2!$D11)","v":""},null,{"$f":"IF(ISBLANK(Data3!$A11),\"\",Data3!$A11)","v":""},{"$f":"IF(ISBLANK(Data3!$B11),\"\",Data3!$B11)","v":""},{"$f":"IF(ISBLANK(Data3!$C11),\"\",Data3!$C11)","v":""},{"$f":"IF(ISBLANK(Data3!$D11),\"\",Data3!$D11)","v":""},null,{"$f":"IF(ISBLANK(Data4!$A11),\"\",Data4!$A11)","v":""},{"$f":"IF(ISBLANK(Data4!$B11),\"\",Data4!$B11)","v":""},{"$f":"IF(ISBLANK(Data4!$C11),\"\",Data4!$C11)","v":""},{"$f":"IF(ISBLANK(Data4!$D11),\"\",Data4!$D11)","v":""}]
[11,{"$f":"IF(ISBLANK(Data1!$A12),\"\",Data1!$A12)","v":""},{"$f":"IF(ISBLANK(Data1!$B12),\"\",Data1!$B12)","v":""},{"$f":"IF(ISBLANK(Data1!$C12),\"\",Data1!$C12)","v":""},{"$f":"IF(ISBLANK(Data1!$D12),\"\",Data1!$D12)","v":""},null,{"$f":"IF(ISBLANK(Data2!$A12),\"\",Data2!$A12)","v":""},{"$f":"IF(ISBLANK(Data2!$B12),\"\",Data2!$B12)","v":""},{"$f":"IF(ISBLANK(Data2!$C12),\"\",Data2!$C12)","v":""},{"$f":"IF(ISBLANK(Data2!$D12),\"\",Data2!$D12)","v":""},null,{"$f":"IF(ISBLANK(Data3!$A12),\"\",Data3!$A12)","v":""},{"$f":"IF(ISBLANK(Data3!$B12),\"\",Data3!$B12)","v":""},{"$f":"IF(ISBLANK(Data3!$C12),\"\",Data3!$C12)","v":""},{"$f":"IF(ISBLANK(Data3!$D12),\"\",Data3!$D12)","v":""},null,{"$f":"IF(ISBLANK(Data4!$A12),\"\",Data4!$A12)","v":""},{"$f":"IF(ISBLANK(Data4!$B12),\"\",Data4!$B12)","v":""},{"$f":"IF(ISBLANK(Data4!$C12),\"\",Data4!$C12)","v":""},{"$f":"IF(ISBLANK(Data4!$D12),\"\",Data4!$D12)","v":""}]
[12,{"$f":"IF(ISBLANK(Data1!$A13),\"\",Data1!$A13)","v":""},{"$f":"IF(ISBLANK(Data1!$B13),\"\",Data1!$B13)","v":""},{"$f":"IF(ISBLANK(Data1!$C13),\"\",Data1!$C13)","v":""},{"$f":"IF(ISBLANK(Data1!$D13),\"\",Data1!$D13)","v":""},null,{"$f":"IF(ISBLANK(Data2!$A13),\"\",Data2!$A13)","v":""},{"$f":"IF(ISBLANK(Data2!$B13),\"\",Data2!$B13)","v":""},{"$f":"IF(ISBLANK(Data2!$C13),\"\",Data2!$C13)","v":""},{"$f":"IF(ISBLANK(Data2!$D13),\"\",Data2!$D13)","v":""},null,{"$f":"IF(ISBLANK(Data3!$A13),\"\",Data3!$A13)","v":""},{"$f":"IF(ISBLANK(Data3!$B13),\"\",Data3!$B13)","v":""},{"$f":"IF(ISBLANK(Data3!$C13),\"\",Data3!$C13)","v":""},{"$f":"IF(ISBLANK(Data3!$D13),\"\",Data3!$D13)","v":""},null,{"$f":"IF(ISBLANK(Data4!$A13),\"\",Data4!$A13)","v":""},{"$f":"IF(ISBLANK(Data4!$B13),\"\",Data4!$B13)","v":""},{"$f":"IF(ISBLANK(Data4!$C13),\"\",Data4!$C13)","v":""},{"$f":"IF(ISBLANK(Data4!$D13),\"\",Data4!$D13)","v":""}]
[13,{"$f":"IF(ISBLANK(Data1!$A14),\"\",Data1!$A14)","v":""},{"$f":"IF(ISBLANK(Data1!$B14),\"\",Data1!$B14)","v":""},{"$f":"IF(ISBLANK(Data1!$C14),\"\",Data1!$C14)","v":""},{"$f":"IF(ISBLANK(Data1!$D14),\"\",Data1!$D14)","v":""},null,{"$f":"IF(ISBLANK(Data2!$A14),\"\",Data2!$A14)","v":""},{"$f":"IF(ISBLANK(Data2!$B14),\"\",Data2!$B14)","v":""},{"$f":"IF(ISBLANK(Data2!$C14),\"\",Data2!$C14)","v":""},{"$f":"IF(ISBLANK(Data2!$D14),\"\",Data2!$D14)","v":""},null,{"$f":"IF(ISBLANK(Data3!$A14),\"\",Data3!$A14)","v":""},{"$f":"IF(ISBLANK(Data3!$B14),\"\",Data3!$B14)","v":""},{"$f":"IF(ISBLANK(Data3!$C14),\"\",Data3!$C14)","v":""},{"$f":"IF(ISBLANK(Data3!$D14),\"\",Data3!$D14)","v":""},null,{"$f":"IF(ISBLANK(Data4!$A14),\"\",Data4!$A14)","v":""},{"$f":"IF(ISBLANK(Data4!$B14),\"\",Data4!$B14)","v":""},{"$f":"IF(ISBLANK(Data4!$C14),\"\",Data4!$C14)","v":""},{"$f":"IF(ISBLANK(Data4!$D14),\"\",Data4!$D14)","v":""}]
[14,{"$f":"IF(ISBLANK(Data1!$A15),\"\",Data1!$A15)","v":""},{"$f":"IF(ISBLANK(Data1!$B15),\"\",Data1!$B15)","v":""},{"$f":"IF(ISBLANK(Data1!$C15),\"\",Data1!$C15)","v":""},{"$f":"IF(ISBLANK(Data1!$D15),\"\",Data1!$D15)","v":""},null,{"$f":"IF(ISBLANK(Data2!$A15),\"\",Data2!$A15)","v":""},{"$f":"IF(ISBLANK(Data2!$B15),\"\",Data2!$B15)","v":""},{"$f":"IF(ISBLANK(Data2!$C15),\"\",Data2!$C15)","v":""},{"$f":"IF(ISBLANK(Data2!$D15),\"\",Data2!$D15)","v":""},null,{"$f":"IF(ISBLANK(Data3!$A15),\"\",Data3!$A15)","v":""},{"$f":"IF(ISBLANK(Data3!$B15),\"\",Data3!$B15)","v":""},{"$f":"IF(ISBLANK(Data3!$C15),\"\",Data3!$C15)","v":""},{"$f":"IF(ISBLANK(Data3!$D15),\"\",Data3!$D15)","v":""},null,{"$f":"IF(ISBLANK(Data4!$A15),\"\",Data4!$A15)","v":""},{"$f":"IF(ISBLANK(Data4!$B15),\"\",Data4!$B15)","v":""},{"$f":"IF(ISBLANK(Data4!$C15),\"\",Data4!$C15)","v":""},{"$f":"IF(ISBLANK(Data4!$D15),\"\",Data4!$D15)","v":""}]
[15,{"$f":"IF(ISBLANK(Data1!$A16),\"\",Data1!$A16)","v":""},{"$f":"IF(ISBLANK(Data1!$B16),\"\",Data1!$B16)","v":""},{"$f":"IF(ISBLANK(Data1!$C16),\"\",Data1!$C16)","v":""},{"$f":"IF(ISBLANK(Data1!$D16),\"\",Data1!$D16)","v":""},null,{"$f":"IF(ISBLANK(Data2!$A16),\"\",Data2!$A16)","v":""},{"$f":"IF(ISBLANK(Data2!$B16),\"\",Data2!$B16)","v":""},{"$f":"IF(ISBLANK(Data2!$C16),\"\",Data2!$C16)","v":""},{"$f":"IF(ISBLANK(Data2!$D16),\"\",Data2!$D16)","v":""},null,{"$f":"IF(ISBLANK(Data3!$A16),\"\",Data3!$A16)","v":""},{"$f":"IF(ISBLANK(Data3!$B16),\"\",Data3!$B16)","v":""},{"$f":"IF(ISBLANK(Data3!$C16),\"\",Data3!$C16)","v":""},{"$f":"IF(ISBLANK(Data3!$D16),\"\",Data3!$D16)","v":""},null,{"$f":"IF(ISBLANK(Data4!$A16),\"\",Data4!$A16)","v":""},{"$f":"IF(ISBLANK(Data4!$B16),\"\",Data4!$B16)","v":""},{"$f":"IF(ISBLANK(Data4!$C16),\"\",Data4!$C16)","v":""},{"$f":"IF(ISBLANK(Data4!$D16),\"\",Data4!$D16)","v":""}]
[16,{"$f":"IF(ISBLANK(Data1!$A17),\"\",Data1!$A17)","v":""},{"$f":"IF(ISBLANK(Data1!$B17),\"\",Data1!$B17)","v":""},{"$f":"IF(ISBLANK(Data1!$C17),\"\",Data1!$C17)","v":""},{"$f":"IF(ISBLANK(Data1!$D17),\"\",Data1!$D17)","v":""},null,{"$f":"IF(ISBLANK(Data2!$A17),\"\",Data2!$A17)","v":""},{"$f":"IF(ISBLANK(Data2!$B17),\"\",Data2!$B17)","v":""},{"$f":"IF(ISBLANK(Data2!$C17),\"\",Data2!$C17)","v":""},{"$f":"IF(ISBLANK(Data2!$D17),\"\",Data2!$D17)","v":""},null,{"$f":"IF(ISBLANK(Data3!$A17),\"\",Data3!$A17)","v":""},{"$f":"IF(ISBLANK(Data3!$B17),\"\",Data3!$B17)","v":""},{"$f":"IF(ISBLANK(Data3!$C17),\"\",Data3!$C17)","v":""},{"$f":"IF(ISBLANK(Data3!$D17),\"\",Data3!$D17)","v":""},null,{"$f":"IF(ISBLANK(Data4!$A17),\"\",Data4!$A17)","v":""},{"$f":"IF(ISBLANK(Data4!$B17),\"\",Data4!$B17)","v":""},{"$f":"IF(ISBLANK(Data4!$C17),\"\",Data4!$C17)","v":""},{"$f":"IF(ISBLANK(Data4!$D17),\"\",Data4!$D17)","v":""}]
[17,{"$f":"IF(ISBLANK(Data1!$A18),\"\",Data1!$A18)","v":""},{"$f":"IF(ISBLANK(Data1!$B18),\"\",Data1!$B18)","v":""},{"$f":"IF(ISBLANK(Data1!$C18),\"\",Data1!$C18)","v":""},{"$f":"IF(ISBLANK(Data1!$D18),\"\",Data1!$D18)","v":""},null,{"$f":"IF(ISBLANK(Data2!$A18),\"\",Data2!$A18)","v":""},{"$f":"IF(ISBLANK(Data2!$B18),\"\",Data2!$B18)","v":""},{"$f":"IF(ISBLANK(Data2!$C18),\"\",Data2!$C18)","v":""},{"$f":"IF(ISBLANK(Data2!$D18),\"\",Data2!$D18)","v":""},null,{"$f":"IF(ISBLANK(Data3!$A18),\"\",Data3!$A18)","v":""},{"$f":"IF(ISBLANK(Data3!$B18),\"\",Data3!$B18)","v":""},{"$f":"IF(ISBLANK(Data3!$C18),\"\",Data3!$C18)","v":""},{"$f":"IF(ISBLANK(Data3!$D18),\"\",Data3!$D18)","v":""},null,{"$f":"IF(ISBLANK(Data4!$A18),\"\",Data4!$A18)","v":""},{"$f":"IF(ISBLANK(Data4!$B18),\"\",Data4!$B18)","v":""},{"$f":"IF(ISBLANK(Data4!$C18),\"\",Data4!$C18)","v":""},{"$f":"IF(ISBLANK(Data4!$D18),\"\",Data4!$D18)","v":""}]
[18,{"$f":"IF(ISBLANK(Data1!$A19),\"\",Data1!$A19)","v":""},{"$f":"IF(ISBLANK(Data1!$B19),\"\",Data1!$B19)","v":""},{"$f":"IF(ISBLANK(Data1!$C19),\"\",Data1!$C19)","v":""},{"$f":"IF(ISBLANK(Data1!$D19),\"\",Data1!$D19)","v":""},null,{"$f":"IF(ISBLANK(Data2!$A19),\"\",Data2!$A19)","v":""},{"$f":"IF(ISBLANK(Data2!$B19),\"\",Data2!$B19)","v":""},{"$f":"IF(ISBLANK(Data2!$C19),\"\",Data2!$C19)","v":""},{"$f":"IF(ISBLANK(Data2!$D19),\"\",Data2!$D19)","v":""},null,{"$f":"IF(ISBLANK(Data3!$A19),\"\",Data3!$A19)","v":""},{"$f":"IF(ISBLANK(Data3!$B19),\"\",Data3!$B19)","v":""},{"$f":"IF(ISBLANK(Data3!$C19),\"\",Data3!$C19)","v":""},{"$f":"IF(ISBLANK(Data3!$D19),\"\",Data3!$D19)","v":""},null,{"$f":"IF(ISBLANK(Data4!$A19),\"\",Data4!$A19)","v":""},{"$f":"IF(ISBLANK(Data4!$B19),\"\",Data4!$B19)","v":""},{"$f":"IF(ISBLANK(Data4!$C19),\"\",Data4!$C19)","v":""},{"$f":"IF(ISBLANK(Data4!$D19),\"\",Data4!$D19)","v":""}]
[19,{"$f":"IF(ISBLANK(Data1!$A20),\"\",Data1!$A20)","v":""},{"$f":"IF(ISBLANK(Data1!$B20),\"\",Data1!$B20)","v":""},{"$f":"IF(ISBLANK(Data1!$C20),\"\",Data1!$C20)","v":""},{"$f":"IF(ISBLANK(Data1!$D20),\"\",Data1!$D20)","v":""},null,{"$f":"IF(ISBLANK(Data2!$A20),\"\",Data2!$A20)","v":""},{"$f":"IF(ISBLANK(Data2!$B20),\"\",Data2!$B20)","v":""},{"$f":"IF(ISBLANK(Data2!$C20),\"\",Data2!$C20)","v":""},{"$f":"IF(ISBLANK(Data2!$D20),\"\",Data2!$D20)","v":""},null,{"$f":"IF(ISBLANK(Data3!$A20),\"\",Data3!$A20)","v":""},{"$f":"IF(ISBLANK(Data3!$B20),\"\",Data3!$B20)","v":""},{"$f":"IF(ISBLANK(Data3!$C20),\"\",Data3!$C20)","v":""},{"$f":"IF(ISBLANK(Data3!$D20),\"\",Data3!$D20)","v":""},null,{"$f":"IF(ISBLANK(Data4!$A20),\"\",Data4!$A20)","v":""},{"$f":"IF(ISBLANK(Data4!$B20),\"\",Data4!$B20)","v":""},{"$f":"IF(ISBLANK(Data4!$C20),\"\",Data4!$C20)","v":""},{"$f":"IF(ISBLANK(Data4!$D20),\"\",Data4!$D20)","v":""}]
[20,{"$f":"IF(ISBLANK(Data1!$A21),\"\",Data1!$A21)","v":""},{"$f":"IF(ISBLANK(Data1!$B21),\"\",Data1!$B21)","v":""},{"$f":"IF(ISBLANK(Data1!$C21),\"\",Data1!$C21)","v":""},{"$f":"IF(ISBLANK(Data1!$D21),\"\",Data1!$D21)","v":""},null,{"$f":"IF(ISBLANK(Data2!$A21),\"\",Data2!$A21)","v":""},{"$f":"IF(ISBLANK(Data2!$B21),\"\",Data2!$B21)","v":""},{"$f":"IF(ISBLANK(Data2!$C21),\"\",Data2!$C21)","v":""},{"$f":"IF(ISBLANK(Data2!$D21),\"\",Data2!$D21)","v":""},null,{"$f":"IF(ISBLANK(Data3!$A21),\"\",Data3!$A21)","v":""},{"$f":"IF(ISBLANK(Data3!$B21),\"\",Data3!$B21)","v":""},{"$f":"IF(ISBLANK(Data3!$C21),\"\",Data3!$C21)","v":""},{"$f":"IF(ISBLANK(Data3!$D21),\"\",Data3!$D21)","v":""},null,{"$f":"IF(ISBLANK(Data4!$A21),\"\",Data4!$A21)","v":""},{"$f":"IF(ISBLANK(Data4!$B21),\"\",Data4!$B21)","v":""},{"$f":"IF(ISBLANK(Data4!$C21),\"\",Data4!$C21)","v":""},{"$f":"IF(ISBLANK(Data4!$D21),\"\",Data4!$D21)","v":""}]
[21,{"$f":"IF(ISBLANK(Data1!$A22),\"\",Data1!$A22)","v":""},{"$f":"IF(ISBLANK(Data1!$B22),\"\",Data1!$B22)","v":""},{"$f":"IF(ISBLANK(Data1!$C22),\"\",Data1!$C22)","v":""},{"$f":"IF(ISBLANK(Data1!$D22),\"\",Data1!$D22)","v":""},null,{"$f":"IF(ISBLANK(Data2!$A22),\"\",Data2!$A22)","v":""},{"$f":"IF(ISBLANK(Data2!$B22),\"\",Data2!$B22)","v":""},{"$f":"IF(ISBLANK(Data2!$C22),\"\",Data2!$C22)","v":""},{"$f":"IF(ISBLANK(Data2!$D22),\"\",Data2!$D22)","v":""},null,{"$f":"IF(ISBLANK(Data3!$A22),\"\",Data3!$A22)","v":""},{"$f":"IF(ISBLANK(Data3!$B22),\"\",Data3!$B22)","v":""},{"$f":"IF(ISBLANK(Data3!$C22),\"\",Data3!$C22)","v":""},{"$f":"IF(ISBLANK(Data3!$D22),\"\",Data3!$D22)","v":""},null,{"$f":"IF(ISBLANK(Data4!$A22),\"\",Data4!$A22)","v":""},{"$f":"IF(ISBLANK(Data4!$B22),\"\",Data4!$B22)","v":""},{"$f":"IF(ISBLANK(Data4!$C22),\"\",Data4!$C22)","v":""},{"$f":"IF(ISBLANK(Data4!$D22),\"\",Data4!$D22)","v":""}]
[22,{"$f":"IF(ISBLANK(Data1!$A23),\"\",Data1!$A23)","v":""},{"$f":"IF(ISBLANK(Data1!$B23),\"\",Data1!$B23)","v":""},{"$f":"IF(ISBLANK(Data1!$C23),\"\",Data1!$C23)","v":""},{"$f":"IF(ISBLANK(Data1!$D23),\"\",Data1!$D23)","v":""},null,{"$f":"IF(ISBLANK(Data2!$A23),\"\",Data2!$A23)","v":""},{"$f":"IF(ISBLANK(Data2!$B23),\"\",Data2!$B23)","v":""},{"$f":"IF(ISBLANK(Data2!$C23),\"\",Data2!$C23)","v":""},{"$f":"IF(ISBLANK(Data2!$D23),\"\",Data2!$D23)","v":""},null,{"$f":"IF(ISBLANK(Data3!$A23),\"\",Data3!$A23)","v":""},{"$f":"IF(ISBLANK(Data3!$B23),\"\",Data3!$B23)","v":""},{"$f":"IF(ISBLANK(Data3!$C23),\"\",Data3!$C23)","v":""},{"$f":"IF(ISBLANK(Data3!$D23),\"\",Data3!$D23)","v":""},null,{"$f":"IF(ISBLANK(Data4!$A23),\"\",Data4!$A23)","v":""},{"$f":"IF(ISBLANK(Data4!$B23),\"\",Data4!$B23)","v":""},{"$f":"IF(ISBLANK(Data4!$C23),\"\",Data4!$C23)","v":""},{"$f":"IF(ISBLANK(Data4!$D23),\"\",Data4!$D23)","v":""}]
[23,{"$f":"IF(ISBLANK(Data1!$A24),\"\",Data1!$A24)","v":""},{"$f":"IF(ISBLANK(Data1!$B24),\"\",Data1!$B24)","v":""},{"$f":"IF(ISBLANK(Data1!$C24),\"\",Data1!$C24)","v":""},{"$f":"IF(ISBLANK(Data1!$D24),\"\",Data1!$D24)","v":""},null,{"$f":"IF(ISBLANK(Data2!$A24),\"\",Data2!$A24)","v":""},{"$f":"IF(ISBLANK(Data2!$B24),\"\",Data2!$B24)","v":""},{"$f":"IF(ISBLANK(Data2!$C24),\"\",Data2!$C24)","v":""},{"$f":"IF(ISBLANK(Data2!$D24),\"\",Data2!$D24)","v":""},null,{"$f":"IF(ISBLANK(Data3!$A24),\"\",Data3!$A24)","v":""},{"$f":"IF(ISBLANK(Data3!$B24),\"\",Data3!$B24)","v":""},{"$f":"IF(ISBLANK(Data3!$C24),\"\",Data3!$C24)","v":""},{"$f":"IF(ISBLANK(Data3!$D24),\"\",Data3!$D24)","v":""},null,{"$f":"IF(ISBLANK(Data4!$A24),\"\",Data4!$A24)","v":""},{"$f":"IF(ISBLANK(Data4!$B24),\"\",Data4!$B24)","v":""},{"$f":"IF(ISBLANK(Data4!$C24),\"\",Data4!$C24)","v":""},{"$f":"IF(ISBLANK(Data4!$D24),\"\",Data4!$D24)","v":""}]
[24,{"$f":"IF(ISBLANK(Data1!$A25),\"\",Data1!$A25)","v":""},{"$f":"IF(ISBLANK(Data1!$B25),\"\",Data1!$B25)","v":""},{"$f":"IF(ISBLANK(Data1!$C25),\"\",Data1!$C25)","v":""},{"$f":"IF(ISBLANK(Data1!$D25),\"\",Data1!$D25)","v":""},null,{"$f":"IF(ISBLANK(Data2!$A25),\"\",Data2!$A25)","v":""},{"$f":"IF(ISBLANK(Data2!$B25),\"\",Data2!$B25)","v":""},{"$f":"IF(ISBLANK(Data2!$C25),\"\",Data2!$C25)","v":""},{"$f":"IF(ISBLANK(Data2!$D25),\"\",Data2!$D25)","v":""},null,{"$f":"IF(ISBLANK(Data3!$A25),\"\",Data3!$A25)","v":""},{"$f":"IF(ISBLANK(Data3!$B25),\"\",Data3!$B25)","v":""},{"$f":"IF(ISBLANK(Data3!$C25),\"\",Data3!$C25)","v":""},{"$f":"IF(ISBLANK(Data3!$D25),\"\",Data3!$D25)","v":""},null,{"$f":"IF(ISBLANK(Data4!$A25),\"\",Data4!$A25)","v":""},{"$f":"IF(ISBLANK(Data4!$B25),\"\",Data4!$B25)","v":""},{"$f":"IF(ISBLANK(Data4!$C25),\"\",Data4!$C25)","v":""},{"$f":"IF(ISBLANK(Data4!$D25),\"\",Data4!$D25)","v":""}]
[25,{"$f":"IF(ISBLANK(Data1!$A26),\"\",Data1!$A26)","v":""},{"$f":"IF(ISBLANK(Data1!$B26),\"\",Data1!$B26)","v":""},{"$f":"IF(ISBLANK(Data1!$C26),\"\",Data1!$C26)","v":""},{"$f":"IF(ISBLANK(Data1!$D26),\"\",Data1!$D26)","v":""},null,{"$f":"IF(ISBLANK(Data2!$A26),\"\",Data2!$A26)","v":""},{"$f":"IF(ISBLANK(Data2!$B26),\"\",Data2!$B26)","v":""},{"$f":"IF(ISBLANK(Data2!$C26),\"\",Data2!$C26)","v":""},{"$f":"IF(ISBLANK(Data2!$D26),\"\",Data2!$D26)","v":""},null,{"$f":"IF(ISBLANK(Data3!$A26),\"\",Data3!$A26)","v":""},{"$f":"IF(ISBLANK(Data3!$B26),\"\",Data3!$B26)","v":""},{"$f":"IF(ISBLANK(Data3!$C26),\"\",Data3!$C26)","v":""},{"$f":"IF(ISBLANK(Data3!$D26),\"\",Data3!$D26)","v":""},null,{"$f":"IF(ISBLANK(Data4!$A26),\"\",Data4!$A26)","v":""},{"$f":"IF(ISBLANK(Data4!$B26),\"\",Data4!$B26)","v":""},{"$f":"IF(ISBLANK(Data4!$C26),\"\",Data4!$C26)","v":""},{"$f":"IF(ISBLANK(Data4!$D26),\"\",Data4!$D26)","v":""}]
[26,{"$f":"IF(ISBLANK(Data1!$A27),\"\",Data1!$A27)","v":""},{"$f":"IF(ISBLANK(Data1!$B27),\"\",Data1!$B27)","v":""},{"$f":"IF(ISBLANK(Data1!$C27),\"\",Data1!$C27)","v":""},{"$f":"IF(ISBLANK(Data1!$D27),\"\",Data1!$D27)","v":""},null,{"$f":"IF(ISBLANK(Data2!$A27),\"\",Data2!$A27)","v":""},{"$f":"IF(ISBLANK(Data2!$B27),\"\",Data2!$B27)","v":""},{"$f":"IF(ISBLANK(Data2!$C27),\"\",Data2!$C27)","v":""},{"$f":"IF(ISBLANK(Data2!$D27),\"\",Data2!$D27)","v":""},null,{"$f":"IF(ISBLANK(Data3!$A27),\"\",Data3!$A27)","v":""},{"$f":"IF(ISBLANK(Data3!$B27),\"\",Data3!$B27)","v":""},{"$f":"IF(ISBLANK(Data3!$C27),\"\",Data3!$C27)","v":""},{"$f":"IF(ISBLANK(Data3!$D27),\"\",Data3!$D27)","v":""},null,{"$f":"IF(ISBLANK(Data4!$A27),\"\",Data4!$A27)","v":""},{"$f":"IF(ISBLANK(Data4!$B27),\"\",Data4!$B27)","v":""},{"$f":"IF(ISBLANK(Data4!$C27),\"\",Data4!$C27)","v":""},{"$f":"IF(ISBLANK(Data4!$D27),\"\",Data4!$D27)","v":""}]
[27,{"$f":"IF(ISBLANK(Data1!$A28),\"\",Data1!$A28)","v":""},{"$f":"IF(ISBLANK(Data1!$B28),\"\",Data1!$B28)","v":""},{"$f":"IF(ISBLANK(Data1!$C28),\"\",Data1!$C28)","v":""},{"$f":"IF(ISBLANK(Data1!$D28),\"\",Data1!$D28)","v":""},null,{"$f":"IF(ISBLANK(Data2!$A28),\"\",Data2!$A28)","v":""},{"$f":"IF(ISBLANK(Data2!$B28),\"\",Data2!$B28)","v":""},{"$f":"IF(ISBLANK(Data2!$C28),\"\",Data2!$C28)","v":""},{"$f":"IF(ISBLANK(Data2!$D28),\"\",Data2!$D28)","v":""},null,{"$f":"IF(ISBLANK(Data3!$A28),\"\",Data3!$A28)","v":""},{"$f":"IF(ISBLANK(Data3!$B28),\"\",Data3!$B28)","v":""},{"$f":"IF(ISBLANK(Data3!$C28),\"\",Data3!$C28)","v":""},{"$f":"IF(ISBLANK(Data3!$D28),\"\",Data3!$D28)","v":""},null,{"$f":"IF(ISBLANK(Data4!$A28),\"\",Data4!$A28)","v":""},{"$f":"IF(ISBLANK(Data4!$B28),\"\",Data4!$B28)","v":""},{"$f":"IF(ISBLANK(Data4!$C28),\"\",Data4!$C28)","v":""},{"$f":"IF(ISBLANK(Data4!$D28),\"\",Data4!$D28)","v":""}]
[28,{"$f":"IF(ISBLANK(Data1!$A29),\"\",Data1!$A29)","v":""},{"$f":"IF(ISBLANK(Data1!$B29),\"\",Data1!$B29)","v":""},{"$f":"IF(ISBLANK(Data1!$C29),\"\",Data1!$C29)","v":""},{"$f":"IF(ISBLANK(Data1!$D29),\"\",Data1!$D29)","v":""},null,{"$f":"IF(ISBLANK(Data2!$A29),\"\",Data2!$A29)","v":""},{"$f":"IF(ISBLANK(Data2!$B29),\"\",Data2!$B29)","v":""},{"$f":"IF(ISBLANK(Data2!$C29),\"\",Data2!$C29)","v":""},{"$f":"IF(ISBLANK(Data2!$D29),\"\",Data2!$D29)","v":""},null,{"$f":"IF(ISBLANK(Data3!$A29),\"\",Data3!$A29)","v":""},{"$f":"IF(ISBLANK(Data3!$B29),\"\",Data3!$B29)","v":""},{"$f":"IF(ISBLANK(Data3!$C29),\"\",Data3!$C29)","v":""},{"$f":"IF(ISBLANK(Data3!$D29),\"\",Data3!$D29)","v":""},null,{"$f":"IF(ISBLANK(Data4!$A29),\"\",Data4!$A29)","v":""},{"$f":"IF(ISBLANK(Data4!$B29),\"\",Data4!$B29)","v":""},{"$f":"IF(ISBLANK(Data4!$C29),\"\",Data4!$C29)","v":""},{"$f":"IF(ISBLANK(Data4!$D29),\"\",Data4!$D29)","v":""}]
[29,{"$f":"IF(ISBLANK(Data1!$A30),\"\",Data1!$A30)","v":""},{"$f":"IF(ISBLANK(Data1!$B30),\"\",Data1!$B30)","v":""},{"$f":"IF(ISBLANK(Data1!$C30),\"\",Data1!$C30)","v":""},{"$f":"IF(ISBLANK(Data1!$D30),\"\",Data1!$D30)","v":""},null,{"$f":"IF(ISBLANK(Data2!$A30),\"\",Data2!$A30)","v":""},{"$f":"IF(ISBLANK(Data2!$B30),\"\",Data2!$B30)","v":""},{"$f":"IF(ISBLANK(Data2!$C30),\"\",Data2!$C30)","v":""},{"$f":"IF(ISBLANK(Data2!$D30),\"\",Data2!$D30)","v":""},null,{"$f":"IF(ISBLANK(Data3!$A30),\"\",Data3!$A30)","v":""},{"$f":"IF(ISBLANK(Data3!$B30),\"\",Data3!$B30)","v":""},{"$f":"IF(ISBLANK(Data3!$C30),\"\",Data3!$C30)","v":""},{"$f":"IF(ISBLANK(Data3!$D30),\"\",Data3!$D30)","v":""},null,{"$f":"IF(ISBLANK(Data4!$A30),\"\",Data4!$A30)","v":""},{"$f":"IF(ISBLANK(Data4!$B30),\"\",Data4!$B30)","v":""},{"$f":"IF(ISBLANK(Data4!$C30),\"\",Data4!$C30)","v":""},{"$f":"IF(ISBLANK(Data4!$D30),\"\",Data4!$D30)","v":""}]
[30,{"$f":"IF(ISBLANK(Data1!$A31),\"\",Data1!$A31)","v":""},{"$f":"IF(ISBLANK(Data1!$B31),\"\",Data1!$B31)","v":""},{"$f":"IF(ISBLANK(Data1!$C31),\"\",Data1!$C31)","v":""},{"$f":"IF(ISBLANK(Data1!$D31),\"\",Data1!$D31)","v":""},null,{"$f":"IF(ISBLANK(Data2!$A31),\"\",Data2!$A31)","v":""},{"$f":"IF(ISBLANK(Data2!$B31),\"\",Data2!$B31)","v":""},{"$f":"IF(ISBLANK(Data2!$C31),\"\",Data2!$C31)","v":""},{"$f":"IF(ISBLANK(Data2!$D31),\"\",Data2!$D31)","v":""},null,{"$f":"IF(ISBLANK(Data3!$A31),\"\",Data3!$A31)","v":""},{"$f":"IF(ISBLANK(Data3!$B31),\"\",Data3!$B31)","v":""},{"$f":"IF(ISBLANK(Data3!$C31),\"\",Data3!$C31)","v":""},{"$f":"IF(ISBLANK(Data3!$D31),\"\",Data3!$D31)","v":""},null,{"$f":"IF(ISBLANK(Data4!$A31),\"\",Data4!$A31)","v":""},{"$f":"IF(ISBLANK(Data4!$B31),\"\",Data4!$B31)","v":""},{"$f":"IF(ISBLANK(Data4!$C31),\"\",Data4!$C31)","v":""},{"$f":"IF(ISBLANK(Data4!$D31),\"\",Data4!$D31)","v":""}]
[31,{"$f":"IF(ISBLANK(Data1!$A32),\"\",Data1!$A32)","v":""},{"$f":"IF(ISBLANK(Data1!$B32),\"\",Data1!$B32)","v":""},{"$f":"IF(ISBLANK(Data1!$C32),\"\",Data1!$C32)","v":""},{"$f":"IF(ISBLANK(Data1!$D32),\"\",Data1!$D32)","v":""},null,{"$f":"IF(ISBLANK(Data2!$A32),\"\",Data2!$A32)","v":""},{"$f":"IF(ISBLANK(Data2!$B32),\"\",Data2!$B32)","v":""},{"$f":"IF(ISBLANK(Data2!$C32),\"\",Data2!$C32)","v":""},{"$f":"IF(ISBLANK(Data2!$D32),\"\",Data2!$D32)","v":""},null,{"$f":"IF(ISBLANK(Data3!$A32),\"\",Data3!$A32)","v":""},{"$f":"IF(ISBLANK(Data3!$B32),\"\",Data3!$B32)","v":""},{"$f":"IF(ISBLANK(Data3!$C32),\"\",Data3!$C32)","v":""},{"$f":"IF(ISBLANK(Data3!$D32),\"\",Data3!$D32)","v":""},null,{"$f":"IF(ISBLANK(Data4!$A32),\"\",Data4!$A32)","v":""},{"$f":"IF(ISBLANK(Data4!$B32),\"\",Data4!$B32)","v":""},{"$f":"IF(ISBLANK(Data4!$C32),\"\",Data4!$C32)","v":""},{"$f":"IF(ISBLANK(Data4!$D32),\"\",Data4!$D32)","v":""}]
[32,{"$f":"IF(ISBLANK(Data1!$A33),\"\",Data1!$A33)","v":""},{"$f":"IF(ISBLANK(Data1!$B33),\"\",Data1!$B33)","v":""},{"$f":"IF(ISBLANK(Data1!$C33),\"\",Data1!$C33)","v":""},{"$f":"IF(ISBLANK(Data1!$D33),\"\",Data1!$D33)","v":""},null,{"$f":"IF(ISBLANK(Data2!$A33),\"\",Data2!$A33)","v":""},{"$f":"IF(ISBLANK(Data2!$B33),\"\",Data2!$B33)","v":""},{"$f":"IF(ISBLANK(Data2!$C33),\"\",Data2!$C33)","v":""},{"$f":"IF(ISBLANK(Data2!$D33),\"\",Data2!$D33)","v":""},null,{"$f":"IF(ISBLANK(Data3!$A33),\"\",Data3!$A33)","v":""},{"$f":"IF(ISBLANK(Data3!$B33),\"\",Data3!$B33)","v":""},{"$f":"IF(ISBLANK(Data3!$C33),\"\",Data3!$C33)","v":""},{"$f":"IF(ISBLANK(Data3!$D33),\"\",Data3!$D33)","v":""},null,{"$f":"IF(ISBLANK(Data4!$A33),\"\",Data4!$A33)","v":""},{"$f":"IF(ISBLANK(Data4!$B33),\"\",Data4!$B33)","v":""},{"$f":"IF(ISBLANK(Data4!$C33),\"\",Data4!$C33)","v":""},{"$f":"IF(ISBLANK(Data4!$D33),\"\",Data4!$D33)","v":""}]
[33,{"$f":"IF(ISBLANK(Data1!$A34),\"\",Data1!$A34)","v":""},{"$f":"IF(ISBLANK(Data1!$B34),\"\",Data1!$B34)","v":""},{"$f":"IF(ISBLANK(Data1!$C34),\"\",Data1!$C34)","v":""},{"$f":"IF(ISBLANK(Data1!$D34),\"\",Data1!$D34)","v":""},null,{"$f":"IF(ISBLANK(Data2!$A34),\"\",Data2!$A34)","v":""},{"$f":"IF(ISBLANK(Data2!$B34),\"\",Data2!$B34)","v":""},{"$f":"IF(ISBLANK(Data2!$C34),\"\",Data2!$C34)","v":""},{"$f":"IF(ISBLANK(Data2!$D34),\"\",Data2!$D34)","v":""},null,{"$f":"IF(ISBLANK(Data3!$A34),\"\",Data3!$A34)","v":""},{"$f":"IF(ISBLANK(Data3!$B34),\"\",Data3!$B34)","v":""},{"$f":"IF(ISBLANK(Data3!$C34),\"\",Data3!$C34)","v":""},{"$f":"IF(ISBLANK(Data3!$D34),\"\",Data3!$D34)","v":""},null,{"$f":"IF(ISBLANK(Data4!$A34),\"\",Data4!$A34)","v":""},{"$f":"IF(ISBLANK(Data4!$B34),\"\",Data4!$B34)","v":""},{"$f":"IF(ISBLANK(Data4!$C34),\"\",Data4!$C34)","v":""},{"$f":"IF(ISBLANK(Data4!$D34),\"\",Data4!$D34)","v":""}]
[34,{"$f":"IF(ISBLANK(Data1!$A35),\"\",Data1!$A35)","v":""},{"$f":"IF(ISBLANK(Data1!$B35),\"\",Data1!$B35)","v":""},{"$f":"IF(ISBLANK(Data1!$C35),\"\",Data1!$C35)","v":""},{"$f":"IF(ISBLANK(Data1!$D35),\"\",Data1!$D35)","v":""},null,{"$f":"IF(ISBLANK(Data2!$A35),\"\",Data2!$A35)","v":""},{"$f":"IF(ISBLANK(Data2!$B35),\"\",Data2!$B35)","v":""},{"$f":"IF(ISBLANK(Data2!$C35),\"\",Data2!$C35)","v":""},{"$f":"IF(ISBLANK(Data2!$D35),\"\",Data2!$D35)","v":""},null,{"$f":"IF(ISBLANK(Data3!$A35),\"\",Data3!$A35)","v":""},{"$f":"IF(ISBLANK(Data3!$B35),\"\",Data3!$B35)","v":""},{"$f":"IF(ISBLANK(Data3!$C35),\"\",Data3!$C35)","v":""},{"$f":"IF(ISBLANK(Data3!$D35),\"\",Data3!$D35)","v":""},null,{"$f":"IF(ISBLANK(Data4!$A35),\"\",Data4!$A35)","v":""},{"$f":"IF(ISBLANK(Data4!$B35),\"\",Data4!$B35)","v":""},{"$f":"IF(ISBLANK(Data4!$C35),\"\",Data4!$C35)","v":""},{"$f":"IF(ISBLANK(Data4!$D35),\"\",Data4!$D35)","v":""}]
[35,{"$f":"IF(ISBLANK(Data1!$A36),\"\",Data1!$A36)","v":""},{"$f":"IF(ISBLANK(Data1!$B36),\"\",Data1!$B36)","v":""},{"$f":"IF(ISBLANK(Data1!$C36),\"\",Data1!$C36)","v":""},{"$f":"IF(ISBLANK(Data1!$D36),\"\",Data1!$D36)","v":""},null,{"$f":"IF(ISBLANK(Data2!$A36),\"\",Data2!$A36)","v":""},{"$f":"IF(ISBLANK(Data2!$B36),\"\",Data2!$B36)","v":""},{"$f":"IF(ISBLANK(Data2!$C36),\"\",Data2!$C36)","v":""},{"$f":"IF(ISBLANK(Data2!$D36),\"\",Data2!$D36)","v":""},null,{"$f":"IF(ISBLANK(Data3!$A36),\"\",Data3!$A36)","v":""},{"$f":"IF(ISBLANK(Data3!$B36),\"\",Data3!$B36)","v":""},{"$f":"IF(ISBLANK(Data3!$C36),\"\",Data3!$C36)","v":""},{"$f":"IF(ISBLANK(Data3!$D36),\"\",Data3!$D36)","v":""},null,{"$f":"IF(ISBLANK(Data4!$A36),\"\",Data4!$A36)","v":""},{"$f":"IF(ISBLANK(Data4!$B36),\"\",Data4!$B36)","v":""},{"$f":"IF(ISBLANK(Data4!$C36),\"\",Data4!$C36)","v":""},{"$f":"IF(ISBLANK(Data4!$D36),\"\",Data4!$D36)","v":""}]
[36,{"$f":"IF(ISBLANK(Data1!$A37),\"\",Data1!$A37)","v":""},{"$f":"IF(ISBLANK(Data1!$B37),\"\",Data1!$B37)","v":""},{"$f":"IF(ISBLANK(Data1!$C37),\"\",Data1!$C37)","v":""},{"$f":"IF(ISBLANK(Data1!$D37),\"\",Data1!$D37)","v":""},null,{"$f":"IF(ISBLANK(Data2!$A37),\"\",Data2!$A37)","v":""},{"$f":"IF(ISBLANK(Data2!$B37),\"\",Data2!$B37)","v":""},{"$f":"IF(ISBLANK(Data2!$C37),\"\",Data2!$C37)","v":""},{"$f":"IF(ISBLANK(Data2!$D37),\"\",Data2!$D37)","v":""},null,{"$f":"IF(ISBLANK(Data3!$A37),\"\",Data3!$A37)","v":""},{"$f":"IF(ISBLANK(Data3!$B37),\"\",Data3!$B37)","v":""},{"$f":"IF(ISBLANK(Data3!$C37),\"\",Data3!$C37)","v":""},{"$f":"IF(ISBLANK(Data3!$D37),\"\",Data3!$D37)","v":""},null,{"$f":"IF(ISBLANK(Data4!$A37),\"\",Data4!$A37)","v":""},{"$f":"IF(ISBLANK(Data4!$B37),\"\",Data4!$B37)","v":""},{"$f":"IF(ISBLANK(Data4!$C37),\"\",Data4!$C37)","v":""},{"$f":"IF(ISBLANK(Data4!$D37),\"\",Data4!$D37)","v":""}]
[37,{"$f":"IF(ISBLANK(Data1!$A38),\"\",Data1!$A38)","v":""},{"$f":"IF(ISBLANK(Data1!$B38),\"\",Data1!$B38)","v":""},{"$f":"IF(ISBLANK(Data1!$C38),\"\",Data1!$C38)","v":""},{"$f":"IF(ISBLANK(Data1!$D38),\"\",Data1!$D38)","v":""},null,{"$f":"IF(ISBLANK(Data2!$A38),\"\",Data2!$A38)","v":""},{"$f":"IF(ISBLANK(Data2!$B38),\"\",Data2!$B38)","v":""},{"$f":"IF(ISBLANK(Data2!$C38),\"\",Data2!$C38)","v":""},{"$f":"IF(ISBLANK(Data2!$D38),\"\",Data2!$D38)","v":""},null,{"$f":"IF(ISBLANK(Data3!$A38),\"\",Data3!$A38)","v":""},{"$f":"IF(ISBLANK(Data3!$B38),\"\",Data3!$B38)","v":""},{"$f":"IF(ISBLANK(Data3!$C38),\"\",Data3!$C38)","v":""},{"$f":"IF(ISBLANK(Data3!$D38),\"\",Data3!$D38)","v":""},null,{"$f":"IF(ISBLANK(Data4!$A38),\"\",Data4!$A38)","v":""},{"$f":"IF(ISBLANK(Data4!$B38),\"\",Data4!$B38)","v":""},{"$f":"IF(ISBLANK(Data4!$C38),\"\",Data4!$C38)","v":""},{"$f":"IF(ISBLANK(Data4!$D38),\"\",Data4!$D38)","v":""}]
[38,{"$f":"IF(ISBLANK(Data1!$A39),\"\",Data1!$A39)","v":""},{"$f":"IF(ISBLANK(Data1!$B39),\"\",Data1!$B39)","v":""},{"$f":"IF(ISBLANK(Data1!$C39),\"\",Data1!$C39)","v":""},{"$f":"IF(ISBLANK(Data1!$D39),\"\",Data1!$D39)","v":""},null,{"$f":"IF(ISBLANK(Data2!$A39),\"\",Data2!$A39)","v":""},{"$f":"IF(ISBLANK(Data2!$B39),\"\",Data2!$B39)","v":""},{"$f":"IF(ISBLANK(Data2!$C39),\"\",Data2!$C39)","v":""},{"$f":"IF(ISBLANK(Data2!$D39),\"\",Data2!$D39)","v":""},null,{"$f":"IF(ISBLANK(Data3!$A39),\"\",Data3!$A39)","v":""},{"$f":"IF(ISBLANK(Data3!$B39),\"\",Data3!$B39)","v":""},{"$f":"IF(ISBLANK(Data3!$C39),\"\",Data3!$C39)","v":""},{"$f":"IF(ISBLANK(Data3!$D39),\"\",Data3!$D39)","v":""},null,{"$f":"IF(ISBLANK(Data4!$A39),\"\",Data4!$A39)","v":""},{"$f":"IF(ISBLANK(Data4!$B39),\"\",Data4!$B39)","v":""},{"$f":"IF(ISBLANK(Data4!$C39),\"\",Data4!$C39)","v":""},{"$f":"IF(ISBLANK(Data4!$D39),\"\",Data4!$D39)","v":""}]
[39,{"$f":"IF(ISBLANK(Data1!$A40),\"\",Data1!$A40)","v":""},{"$f":"IF(ISBLANK(Data1!$B40),\"\",Data1!$B40)","v":""},{"$f":"IF(ISBLANK(Data1!$C40),\"\",Data1!$C40)","v":""},{"$f":"IF(ISBLANK(Data1!$D40),\"\",Data1!$D40)","v":""},null,{"$f":"IF(ISBLANK(Data2!$A40),\"\",Data2!$A40)","v":""},{"$f":"IF(ISBLANK(Data2!$B40),\"\",Data2!$B40)","v":""},{"$f":"IF(ISBLANK(Data2!$C40),\"\",Data2!$C40)","v":""},{"$f":"IF(ISBLANK(Data2!$D40),\"\",Data2!$D40)","v":""},null,{"$f":"IF(ISBLANK(Data3!$A40),\"\",Data3!$A40)","v":""},{"$f":"IF(ISBLANK(Data3!$B40),\"\",Data3!$B40)","v":""},{"$f":"IF(ISBLANK(Data3!$C40),\"\",Data3!$C40)","v":""},{"$f":"IF(ISBLANK(Data3!$D40),\"\",Data3!$D40)","v":""},null,{"$f":"IF(ISBLANK(Data4!$A40),\"\",Data4!$A40)","v":""},{"$f":"IF(ISBLANK(Data4!$B40),\"\",Data4!$B40)","v":""},{"$f":"IF(ISBLANK(Data4!$C40),\"\",Data4!$C40)","v":""},{"$f":"IF(ISBLANK(Data4!$D40),\"\",Data4!$D40)","v":""}]
[40,{"$f":"IF(ISBLANK(Data1!$A41),\"\",Data1!$A41)","v":""},{"$f":"IF(ISBLANK(Data1!$B41),\"\",Data1!$B41)","v":""},{"$f":"IF(ISBLANK(Data1!$C41),\"\",Data1!$C41)","v":""},{"$f":"IF(ISBLANK(Data1!$D41),\"\",Data1!$D41)","v":""},null,{"$f":"IF(ISBLANK(Data2!$A41),\"\",Data2!$A41)","v":""},{"$f":"IF(ISBLANK(Data2!$B41),\"\",Data2!$B41)","v":""},{"$f":"IF(ISBLANK(Data2!$C41),\"\",Data2!$C41)","v":""},{"$f":"IF(ISBLANK(Data2!$D41),\"\",Data2!$D41)","v":""},null,{"$f":"IF(ISBLANK(Data3!$A41),\"\",Data3!$A41)","v":""},{"$f":"IF(ISBLANK(Data3!$B41),\"\",Data3!$B41)","v":""},{"$f":"IF(ISBLANK(Data3!$C41),\"\",Data3!$C41)","v":""},{"$f":"IF(ISBLANK(Data3!$D41),\"\",Data3!$D41)","v":""},null,{"$f":"IF(ISBLANK(Data4!$A41),\"\",Data4!$A41)","v":""},{"$f":"IF(ISBLANK(Data4!$B41),\"\",Data4!$B41)","v":""},{"$f":"IF(ISBLANK(Data4!$C41),\"\",Data4!$C41)","v":""},{"$f":"IF(ISBLANK(Data4!$D41),\"\",Data4!$D41)","v":""}]
[41,{"$f":"IF(ISBLANK(Data1!$A42),\"\",Data1!$A42)","v":""},{"$f":"IF(ISBLANK(Data1!$B42),\"\",Data1!$B42)","v":""},{"$f":"IF(ISBLANK(Data1!$C42),\"\",Data1!$C42)","v":""},{"$f":"IF(ISBLANK(Data1!$D42),\"\",Data1!$D42)","v":""},null,{"$f":"IF(ISBLANK(Data2!$A42),\"\",Data2!$A42)","v":""},{"$f":"IF(ISBLANK(Data2!$B42),\"\",Data2!$B42)","v":""},{"$f":"IF(ISBLANK(Data2!$C42),\"\",Data2!$C42)","v":""},{"$f":"IF(ISBLANK(Data2!$D42),\"\",Data2!$D42)","v":""},null,{"$f":"IF(ISBLANK(Data3!$A42),\"\",Data3!$A42)","v":""},{"$f":"IF(ISBLANK(Data3!$B42),\"\",Data3!$B42)","v":""},{"$f":"IF(ISBLANK(Data3!$C42),\"\",Data3!$C42)","v":""},{"$f":"IF(ISBLANK(Data3!$D42),\"\",Data3!$D42)","v":""},null,{"$f":"IF(ISBLANK(Data4!$A42),\"\",Data4!$A42)","v":""},{"$f":"IF(ISBLANK(Data4!$B42),\"\",Data4!$B42)","v":""},{"$f":"IF(ISBLANK(Data4!$C42),\"\",Data4!$C42)","v":""},{"$f":"IF(ISBLANK(Data4!$D42),\"\",Data4!$D42)","v":""}]
[42,{"$f":"IF(ISBLANK(Data1!$A43),\"\",Data1!$A43)","v":""},{"$f":"IF(ISBLANK(Data1!$B43),\"\",Data1!$B43)","v":""},{"$f":"IF(ISBLANK(Data1!$C43),\"\",Data1!$C43)","v":""},{"$f":"IF(ISBLANK(Data1!$D43),\"\",Data1!$D43)","v":""},null,{"$f":"IF(ISBLANK(Data2!$A43),\"\",Data2!$A43)","v":""},{"$f":"IF(ISBLANK(Data2!$B43),\"\",Data2!$B43)","v":""},{"$f":"IF(ISBLANK(Data2!$C43),\"\",Data2!$C43)","v":""},{"$f":"IF(ISBLANK(Data2!$D43),\"\",Data2!$D43)","v":""},null,{"$f":"IF(ISBLANK(Data3!$A43),\"\",Data3!$A43)","v":""},{"$f":"IF(ISBLANK(Data3!$B43),\"\",Data3!$B43)","v":""},{"$f":"IF(ISBLANK(Data3!$C43),\"\",Data3!$C43)","v":""},{"$f":"IF(ISBLANK(Data3!$D43),\"\",Data3!$D43)","v":""},null,{"$f":"IF(ISBLANK(Data4!$A43),\"\",Data4!$A43)","v":""},{"$f":"IF(ISBLANK(Data4!$B43),\"\",Data4!$B43)","v":""},{"$f":"IF(ISBLANK(Data4!$C43),\"\",Data4!$C43)","v":""},{"$f":"IF(ISBLANK(Data4!$D43),\"\",Data4!$D43)","v":""}]
[43,{"$f":"IF(ISBLANK(Data1!$A44),\"\",Data1!$A44)","v":""},{"$f":"IF(ISBLANK(Data1!$B44),\"\",Data1!$B44)","v":""},{"$f":"IF(ISBLANK(Data1!$C44),\"\",Data1!$C44)","v":""},{"$f":"IF(ISBLANK(Data1!$D44),\"\",Data1!$D44)","v":""},null,{"$f":"IF(ISBLANK(Data2!$A44),\"\",Data2!$A44)","v":""},{"$f":"IF(ISBLANK(Data2!$B44),\"\",Data2!$B44)","v":""},{"$f":"IF(ISBLANK(Data2!$C44),\"\",Data2!$C44)","v":""},{"$f":"IF(ISBLANK(Data2!$D44),\"\",Data2!$D44)","v":""},null,{"$f":"IF(ISBLANK(Data3!$A44),\"\",Data3!$A44)","v":""},{"$f":"IF(ISBLANK(Data3!$B44),\"\",Data3!$B44)","v":""},{"$f":"IF(ISBLANK(Data3!$C44),\"\",Data3!$C44)","v":""},{"$f":"IF(ISBLANK(Data3!$D44),\"\",Data3!$D44)","v":""},null,{"$f":"IF(ISBLANK(Data4!$A44),\"\",Data4!$A44)","v":""},{"$f":"IF(ISBLANK(Data4!$B44),\"\",Data4!$B44)","v":""},{"$f":"IF(ISBLANK(Data4!$C44),\"\",Data4!$C44)","v":""},{"$f":"IF(ISBLANK(Data4!$D44),\"\",Data4!$D44)","v":""}]
[44,{"$f":"IF(ISBLANK(Data1!$A45),\"\",Data1!$A45)","v":""},{"$f":"IF(ISBLANK(Data1!$B45),\"\",Data1!$B45)","v":""},{"$f":"IF(ISBLANK(Data1!$C45),\"\",Data1!$C45)","v":""},{"$f":"IF(ISBLANK(Data1!$D45),\"\",Data1!$D45)","v":""},null,{"$f":"IF(ISBLANK(Data2!$A45),\"\",Data2!$A45)","v":""},{"$f":"IF(ISBLANK(Data2!$B45),\"\",Data2!$B45)","v":""},{"$f":"IF(ISBLANK(Data2!$C45),\"\",Data2!$C45)","v":""},{"$f":"IF(ISBLANK(Data2!$D45),\"\",Data2!$D45)","v":""},null,{"$f":"IF(ISBLANK(Data3!$A45),\"\",Data3!$A45)","v":""},{"$f":"IF(ISBLANK(Data3!$B45),\"\",Data3!$B45)","v":""},{"$f":"IF(ISBLANK(Data3!$C45),\"\",Data3!$C45)","v":""},{"$f":"IF(ISBLANK(Data3!$D45),\"\",Data3!$D45)","v":""},null,{"$f":"IF(ISBLANK(Data4!$A45),\"\",Data4!$A45)","v":""},{"$f":"IF(ISBLANK(Data4!$B45),\"\",Data4!$B45)","v":""},{"$f":"IF(ISBLANK(Data4!$C45),\"\",Data4!$C45)","v":""},{"$f":"IF(ISBLANK(Data4!$D45),\"\",Data4!$D45)","v":""}]
[45,{"$f":"IF(ISBLANK(Data1!$A46),\"\",Data1!$A46)","v":""},{"$f":"IF(ISBLANK(Data1!$B46),\"\",Data1!$B46)","v":""},{"$f":"IF(ISBLANK(Data1!$C46),\"\",Data1!$C46)","v":""},{"$f":"IF(ISBLANK(Data1!$D46),\"\",Data1!$D46)","v":""},null,{"$f":"IF(ISBLANK(Data2!$A46),\"\",Data2!$A46)","v":""},{"$f":"IF(ISBLANK(Data2!$B46),\"\",Data2!$B46)","v":""},{"$f":"IF(ISBLANK(Data2!$C46),\"\",Data2!$C46)","v":""},{"$f":"IF(ISBLANK(Data2!$D46),\"\",Data2!$D46)","v":""},null,{"$f":"IF(ISBLANK(Data3!$A46),\"\",Data3!$A46)","v":""},{"$f":"IF(ISBLANK(Data3!$B46),\"\",Data3!$B46)","v":""},{"$f":"IF(ISBLANK(Data3!$C46),\"\",Data3!$C46)","v":""},{"$f":"IF(ISBLANK(Data3!$D46),\"\",Data3!$D46)","v":""},null,{"$f":"IF(ISBLANK(Data4!$A46),\"\",Data4!$A46)","v":""},{"$f":"IF(ISBLANK(Data4!$B46),\"\",Data4!$B46)","v":""},{"$f":"IF(ISBLANK(Data4!$C46),\"\",Data4!$C46)","v":""},{"$f":"IF(ISBLANK(Data4!$D46),\"\",Data4!$D46)","v":""}]
[46,{"$f":"IF(ISBLANK(Data1!$A47),\"\",Data1!$A47)","v":""},{"$f":"IF(ISBLANK(Data1!$B47),\"\",Data1!$B47)","v":""},{"$f":"IF(ISBLANK(Data1!$C47),\"\",Data1!$C47)","v":""},{"$f":"IF(ISBLANK(Data1!$D47),\"\",Data1!$D47)","v":""},null,{"$f":"IF(ISBLANK(Data2!$A47),\"\",Data2!$A47)","v":""},{"$f":"IF(ISBLANK(Data2!$B47),\"\",Data2!$B47)","v":""},{"$f":"IF(ISBLANK(Data2!$C47),\"\",Data2!$C47)","v":""},{"$f":"IF(ISBLANK(Data2!$D47),\"\",Data2!$D47)","v":""},null,{"$f":"IF(ISBLANK(Data3!$A47),\"\",Data3!$A47)","v":""},{"$f":"IF(ISBLANK(Data3!$B47),\"\",Data3!$B47)","v":""},{"$f":"IF(ISBLANK(Data3!$C47),\"\",Data3!$C47)","v":""},{"$f":"IF(ISBLANK(Data3!$D47),\"\",Data3!$D47)","v":""},null,{"$f":"IF(ISBLANK(Data4!$A47),\"\",Data4!$A47)","v":""},{"$f":"IF(ISBLANK(Data4!$B47),\"\",Data4!$B47)","v":""},{"$f":"IF(ISBLANK(Data4!$C47),\"\",Data4!$C47)","v":""},{"$f":"IF(ISBLANK(Data4!$D47),\"\",Data4!$D47)","v":""}]
[47,{"$f":"IF(ISBLANK(Data1!$A48),\"\",Data1!$A48)","v":""},{"$f":"IF(ISBLANK(Data1!$B48),\"\",Data1!$B48)","v":""},{"$f":"IF(ISBLANK(Data1!$C48),\"\",Data1!$C48)","v":""},{"$f":"IF(ISBLANK(Data1!$D48),\"\",Data1!$D48)","v":""},null,{"$f":"IF(ISBLANK(Data2!$A48),\"\",Data2!$A48)","v":""},{"$f":"IF(ISBLANK(Data2!$B48),\"\",Data2!$B48)","v":""},{"$f":"IF(ISBLANK(Data2!$C48),\"\",Data2!$C48)","v":""},{"$f":"IF(ISBLANK(Data2!$D48),\"\",Data2!$D48)","v":""},null,{"$f":"IF(ISBLANK(Data3!$A48),\"\",Data3!$A48)","v":""},{"$f":"IF(ISBLANK(Data3!$B48),\"\",Data3!$B48)","v":""},{"$f":"IF(ISBLANK(Data3!$C48),\"\",Data3!$C48)","v":""},{"$f":"IF(ISBLANK(Data3!$D48),\"\",Data3!$D48)","v":""},null,{"$f":"IF(ISBLANK(Data4!$A48),\"\",Data4!$A48)","v":""},{"$f":"IF(ISBLANK(Data4!$B48),\"\",Data4!$B48)","v":""},{"$f":"IF(ISBLANK(Data4!$C48),\"\",Data4!$C48)","v":""},{"$f":"IF(ISBLANK(Data4!$D48),\"\",Data4!$D48)","v":""}]
[48,{"$f":"IF(ISBLANK(Data1!$A49),\"\",Data1!$A49)","v":""},{"$f":"IF(ISBLANK(Data1!$B49),\"\",Data1!$B49)","v":""},{"$f":"IF(ISBLANK(Data1!$C49),\"\",Data1!$C49)","v":""},{"$f":"IF(ISBLANK(Data1!$D49),\"\",Data1!$D49)","v":""},null,{"$f":"IF(ISBLANK(Data2!$A49),\"\",Data2!$A49)","v":""},{"$f":"IF(ISBLANK(Data2!$B49),\"\",Data2!$B49)","v":""},{"$f":"IF(ISBLANK(Data2!$C49),\"\",Data2!$C49)","v":""},{"$f":"IF(ISBLANK(Data2!$D49),\"\",Data2!$D49)","v":""},null,{"$f":"IF(ISBLANK(Data3!$A49),\"\",Data3!$A49)","v":""},{"$f":"IF(ISBLANK(Data3!$B49),\"\",Data3!$B49)","v":""},{"$f":"IF(ISBLANK(Data3!$C49),\"\",Data3!$C49)","v":""},{"$f":"IF(ISBLANK(Data3!$D49),\"\",Data3!$D49)","v":""},null,{"$f":"IF(ISBLANK(Data4!$A49),\"\",Data4!$A49)","v":""},{"$f":"IF(ISBLANK(Data4!$B49),\"\",Data4!$B49)","v":""},{"$f":"IF(ISBLANK(Data4!$C49),\"\",Data4!$C49)","v":""},{"$f":"IF(ISBLANK(Data4!$D49),\"\",Data4!$D49)","v":""}]
[49,{"$f":"IF(ISBLANK(Data1!$A50),\"\",Data1!$A50)","v":""},{"$f":"IF(ISBLANK(Data1!$B50),\"\",Data1!$B50)","v":""},{"$f":"IF(ISBLANK(Data1!$C50),\"\",Data1!$C50)","v":""},{"$f":"IF(ISBLANK(Data1!$D50),\"\",Data1!$D50)","v":""},null,{"$f":"IF(ISBLANK(Data2!$A50),\"\",Data2!$A50)","v":""},{"$f":"IF(ISBLANK(Data2!$B50),\"\",Data2!$B50)","v":""},{"$f":"IF(ISBLANK(Data2!$C50),\"\",Data2!$C50)","v":""},{"$f":"IF(ISBLANK(Data2!$D50),\"\",Data2!$D50)","v":""},null,{"$f":"IF(ISBLANK(Data3!$A50),\"\",Data3!$A50)","v":""},{"$f":"IF(ISBLANK(Data3!$B50),\"\",Data3!$B50)","v":""},{"$f":"IF(ISBLANK(Data3!$C50),\"\",Data3!$C50)","v":""},{"$f":"IF(ISBLANK(Data3!$D50),\"\",Data3!$D50)","v":""},null,{"$f":"IF(ISBLANK(Data4!$A50),\"\",Data4!$A50)","v":""},{"$f":"IF(ISBLANK(Data4!$B50),\"\",Data4!$B50)","v":""},{"$f":"IF(ISBLANK(Data4!$C50),\"\",Data4!$C50)","v":""},{"$f":"IF(ISBLANK(Data4!$D50),\"\",Data4!$D50)","v":""}]
[50,{"$f":"IF(ISBLANK(Data1!$A51),\"\",Data1!$A51)","v":""},{"$f":"IF(ISBLANK(Data1!$B51),\"\",Data1!$B51)","v":""},{"$f":"IF(ISBLANK(Data1!$C51),\"\",Data1!$C51)","v":""},{"$f":"IF(ISBLANK(Data1!$D51),\"\",Data1!$D51)","v":""},null,{"$f":"IF(ISBLANK(Data2!$A51),\"\",Data2!$A51)","v":""},{"$f":"IF(ISBLANK(Data2!$B51),\"\",Data2!$B51)","v":""},{"$f":"IF(ISBLANK(Data2!$C51),\"\",Data2!$C51)","v":""},{"$f":"IF(ISBLANK(Data2!$D51),\"\",Data2!$D51)","v":""},null,{"$f":"IF(ISBLANK(Data3!$A51),\"\",Data3!$A51)","v":""},{"$f":"IF(ISBLANK(Data3!$B51),\"\",Data3!$B51)","v":""},{"$f":"IF(ISBLANK(Data3!$C51),\"\",Data3!$C51)","v":""},{"$f":"IF(ISBLANK(Data3!$D51),\"\",Data3!$D51)","v":""},null,{"$f":"IF(ISBLANK(Data4!$A51),\"\",Data4!$A51)","v":""},{"$f":"IF(ISBLANK(Data4!$B51),\"\",Data4!$B51)","v":""},{"$f":"IF(ISBLANK(Data4!$C51),\"\",Data4!$C51)","v":""},{"$f":"IF(ISBLANK(Data4!$D51),\"\",Data4!$D51)","v":""}]

{"sheet":"GraphData","index":2,"n_rows":55,"n_cols":12,"rows_kept":55,"cut":false,"hidden":false,"merged":[[3,0,3,2],[3,3,3,5],[3,6,3,8],[3,9,3,11]]}
["DistSel",1,null,"testType",{"$f":"IF(OR(Data1!testType=\"COMP+REB\", Data2!testType=\"COMP+REB\", Data3!testType=\"COMP+REB\", Data4!testType=\"COMP+REB\"), \"COMP+REB\", \"COMP_ONLY\")","v":"COMP_ONLY"}]
["LoadSel",1,null,"units",{"$f":"IF(OR(Data1!units=\"MET\", Data2!units=\"MET\", Data3!units=\"MET\", Data4!units=\"MET\"), \"MET\", \"ENG\")","v":"ENG"}]
[]
["DATA1",null,null,"DATA2",null,null,"DATA3",null,null,"DATA4"]
["Distance (X)","Load (Y)","Rebound","Distance (X)","Load (Y)","Rebound","Distance (X)","Load (Y)","Rebound","Distance (X)","Load (Y)","Rebound"]
[{"$f":"CHOOSE(DistSel,IF(ISBLANK(Data1!$A2),NA(),Data1!$A2),IF(ISBLANK(Data1!$B2),NA(),Data1!$B2))","v":{"$error":"#N/A"}},{"$f":"CHOOSE(LoadSel,IF(ISBLANK(Data1!$C2),NA(),Data1!$C2),IF(ISBLANK(Data1!$D2),NA(),Data1!$D2))","v":{"$error":"#N/A"}},{"$f":"IF(Data1!testType=\"COMP+REB\", IF(ISBLANK(Data1!D2), NA(), Data1!D2), NA())","v":{"$error":"#N/A"}},{"$f":"CHOOSE(DistSel,IF(ISBLANK(Data2!$A2),NA(),Data2!$A2),IF(ISBLANK(Data2!$B2),NA(),Data2!$B2))","v":{"$error":"#N/A"}},{"$f":"CHOOSE(LoadSel,IF(ISBLANK(Data2!$C2),NA(),Data2!$C2),IF(ISBLANK(Data2!$D2),NA(),Data2!$D2))","v":{"$error":"#N/A"}},{"$f":"IF(Data2!testType=\"COMP+REB\", IF(ISBLANK(Data2!D2), NA(), Data2!D2), NA())","v":{"$error":"#N/A"}},{"$f":"CHOOSE(DistSel,IF(ISBLANK(Data3!$A2),NA(),Data3!$A2),IF(ISBLANK(Data3!$B2),NA(),Data3!$B2))","v":{"$error":"#N/A"}},{"$f":"CHOOSE(LoadSel,IF(ISBLANK(Data3!$C2),NA(),Data3!$C2),IF(ISBLANK(Data3!$D2),NA(),Data3!$D2))","v":{"$error":"#N/A"}},{"$f":"IF(Data3!testType=\"COMP+REB\", IF(ISBLANK(Data3!D2), NA(), Data3!D2), NA())","v":{"$error":"#N/A"}},{"$f":"CHOOSE(DistSel,IF(ISBLANK(Data4!$A2),NA(),Data4!$A2),IF(ISBLANK(Data4!$B2),NA(),Data4!$B2))","v":{"$error":"#N/A"}},{"$f":"CHOOSE(LoadSel,IF(ISBLANK(Data4!$C2),NA(),Data4!$C2),IF(ISBLANK(Data4!$D2),NA(),Data4!$D2))","v":{"$error":"#N/A"}},{"$f":"IF(Data4!testType=\"COMP+REB\", IF(ISBLANK(Data4!D2), NA(), Data4!D2), NA())","v":{"$error":"#N/A"}}]
[{"$f":"CHOOSE(DistSel,IF(ISBLANK(Data1!$A3),NA(),Data1!$A3),IF(ISBLANK(Data1!$B3),NA(),Data1!$B3))","v":{"$error":"#N/A"}},{"$f":"CHOOSE(LoadSel,IF(ISBLANK(Data1!$C3),NA(),Data1!$C3),IF(ISBLANK(Data1!$D3),NA(),Data1!$D3))","v":{"$error":"#N/A"}},{"$f":"IF(Data1!testType=\"COMP+REB\", IF(ISBLANK(Data1!D3), NA(), Data1!D3), NA())","v":{"$error":"#N/A"}},{"$f":"CHOOSE(DistSel,IF(ISBLANK(Data2!$A3),NA(),Data2!$A3),IF(ISBLANK(Data2!$B3),NA(),Data2!$B3))","v":{"$error":"#N/A"}},{"$f":"CHOOSE(LoadSel,IF(ISBLANK(Data2!$C3),NA(),Data2!$C3),IF(ISBLANK(Data2!$D3),NA(),Data2!$D3))","v":{"$error":"#N/A"}},{"$f":"IF(Data2!testType=\"COMP+REB\", IF(ISBLANK(Data2!D3), NA(), Data2!D3), NA())","v":{"$error":"#N/A"}},{"$f":"CHOOSE(DistSel,IF(ISBLANK(Data3!$A3),NA(),Data3!$A3),IF(ISBLANK(Data3!$B3),NA(),Data3!$B3))","v":{"$error":"#N/A"}},{"$f":"CHOOSE(LoadSel,IF(ISBLANK(Data3!$C3),NA(),Data3!$C3),IF(ISBLANK(Data3!$D3),NA(),Data3!$D3))","v":{"$error":"#N/A"}},{"$f":"IF(Data3!testType=\"COMP+REB\", IF(ISBLANK(Data3!D3), NA(), Data3!D3), NA())","v":{"$error":"#N/A"}},{"$f":"CHOOSE(DistSel,IF(ISBLANK(Data4!$A3),NA(),Data4!$A3),IF(ISBLANK(Data4!$B3),NA(),Data4!$B3))","v":{"$error":"#N/A"}},{"$f":"CHOOSE(LoadSel,IF(ISBLANK(Data4!$C3),NA(),Data4!$C3),IF(ISBLANK(Data4!$D3),NA(),Data4!$D3))","v":{"$error":"#N/A"}},{"$f":"IF(Data4!testType=\"COMP+REB\", IF(ISBLANK(Data4!D3), NA(), Data4!D3), NA())","v":{"$error":"#N/A"}}]
[{"$f":"CHOOSE(DistSel,IF(ISBLANK(Data1!$A4),NA(),Data1!$A4),IF(ISBLANK(Data1!$B4),NA(),Data1!$B4))","v":{"$error":"#N/A"}},{"$f":"CHOOSE(LoadSel,IF(ISBLANK(Data1!$C4),NA(),Data1!$C4),IF(ISBLANK(Data1!$D4),NA(),Data1!$D4))","v":{"$error":"#N/A"}},{"$f":"IF(Data1!testType=\"COMP+REB\", IF(ISBLANK(Data1!D4), NA(), Data1!D4), NA())","v":{"$error":"#N/A"}},{"$f":"CHOOSE(DistSel,IF(ISBLANK(Data2!$A4),NA(),Data2!$A4),IF(ISBLANK(Data2!$B4),NA(),Data2!$B4))","v":{"$error":"#N/A"}},{"$f":"CHOOSE(LoadSel,IF(ISBLANK(Data2!$C4),NA(),Data2!$C4),IF(ISBLANK(Data2!$D4),NA(),Data2!$D4))","v":{"$error":"#N/A"}},{"$f":"IF(Data2!testType=\"COMP+REB\", IF(ISBLANK(Data2!D4), NA(), Data2!D4), NA())","v":{"$error":"#N/A"}},{"$f":"CHOOSE(DistSel,IF(ISBLANK(Data3!$A4),NA(),Data3!$A4),IF(ISBLANK(Data3!$B4),NA(),Data3!$B4))","v":{"$error":"#N/A"}},{"$f":"CHOOSE(LoadSel,IF(ISBLANK(Data3!$C4),NA(),Data3!$C4),IF(ISBLANK(Data3!$D4),NA(),Data3!$D4))","v":{"$error":"#N/A"}},{"$f":"IF(Data3!testType=\"COMP+REB\", IF(ISBLANK(Data3!D4), NA(), Data3!D4), NA())","v":{"$error":"#N/A"}},{"$f":"CHOOSE(DistSel,IF(ISBLANK(Data4!$A4),NA(),Data4!$A4),IF(ISBLANK(Data4!$B4),NA(),Data4!$B4))","v":{"$error":"#N/A"}},{"$f":"CHOOSE(LoadSel,IF(ISBLANK(Data4!$C4),NA(),Data4!$C4),IF(ISBLANK(Data4!$D4),NA(),Data4!$D4))","v":{"$error":"#N/A"}},{"$f":"IF(Data4!testType=\"COMP+REB\", IF(ISBLANK(Data4!D4), NA(), Data4!D4), NA())","v":{"$error":"#N/A"}}]
[{"$f":"CHOOSE(DistSel,IF(ISBLANK(Data1!$A5),NA(),Data1!$A5),IF(ISBLANK(Data1!$B5),NA(),Data1!$B5))","v":{"$error":"#N/A"}},{"$f":"CHOOSE(LoadSel,IF(ISBLANK(Data1!$C5),NA(),Data1!$C5),IF(ISBLANK(Data1!$D5),NA(),Data1!$D5))","v":{"$error":"#N/A"}},{"$f":"IF(Data1!testType=\"COMP+REB\", IF(ISBLANK(Data1!D5), NA(), Data1!D5), NA())","v":{"$error":"#N/A"}},{"$f":"CHOOSE(DistSel,IF(ISBLANK(Data2!$A5),NA(),Data2!$A5),IF(ISBLANK(Data2!$B5),NA(),Data2!$B5))","v":{"$error":"#N/A"}},{"$f":"CHOOSE(LoadSel,IF(ISBLANK(Data2!$C5),NA(),Data2!$C5),IF(ISBLANK(Data2!$D5),NA(),Data2!$D5))","v":{"$error":"#N/A"}},{"$f":"IF(Data2!testType=\"COMP+REB\", IF(ISBLANK(Data2!D5), NA(), Data2!D5), NA())","v":{"$error":"#N/A"}},{"$f":"CHOOSE(DistSel,IF(ISBLANK(Data3!$A5),NA(),Data3!$A5),IF(ISBLANK(Data3!$B5),NA(),Data3!$B5))","v":{"$error":"#N/A"}},{"$f":"CHOOSE(LoadSel,IF(ISBLANK(Data3!$C5),NA(),Data3!$C5),IF(ISBLANK(Data3!$D5),NA(),Data3!$D5))","v":{"$error":"#N/A"}},{"$f":"IF(Data3!testType=\"COMP+REB\", IF(ISBLANK(Data3!D5), NA(), Data3!D5), NA())","v":{"$error":"#N/A"}},{"$f":"CHOOSE(DistSel,IF(ISBLANK(Data4!$A5),NA(),Data4!$A5),IF(ISBLANK(Data4!$B5),NA(),Data4!$B5))","v":{"$error":"#N/A"}},{"$f":"CHOOSE(LoadSel,IF(ISBLANK(Data4!$C5),NA(),Data4!$C5),IF(ISBLANK(Data4!$D5),NA(),Data4!$D5))","v":{"$error":"#N/A"}},{"$f":"IF(Data4!testType=\"COMP+REB\", IF(ISBLANK(Data4!D5), NA(), Data4!D5), NA())","v":{"$error":"#N/A"}}]
[{"$f":"CHOOSE(DistSel,IF(ISBLANK(Data1!$A6),NA(),Data1!$A6),IF(ISBLANK(Data1!$B6),NA(),Data1!$B6))","v":{"$error":"#N/A"}},{"$f":"CHOOSE(LoadSel,IF(ISBLANK(Data1!$C6),NA(),Data1!$C6),IF(ISBLANK(Data1!$D6),NA(),Data1!$D6))","v":{"$error":"#N/A"}},{"$f":"IF(Data1!testType=\"COMP+REB\", IF(ISBLANK(Data1!D6), NA(), Data1!D6), NA())","v":{"$error":"#N/A"}},{"$f":"CHOOSE(DistSel,IF(ISBLANK(Data2!$A6),NA(),Data2!$A6),IF(ISBLANK(Data2!$B6),NA(),Data2!$B6))","v":{"$error":"#N/A"}},{"$f":"CHOOSE(LoadSel,IF(ISBLANK(Data2!$C6),NA(),Data2!$C6),IF(ISBLANK(Data2!$D6),NA(),Data2!$D6))","v":{"$error":"#N/A"}},{"$f":"IF(Data2!testType=\"COMP+REB\", IF(ISBLANK(Data2!D6), NA(), Data2!D6), NA())","v":{"$error":"#N/A"}},{"$f":"CHOOSE(DistSel,IF(ISBLANK(Data3!$A6),NA(),Data3!$A6),IF(ISBLANK(Data3!$B6),NA(),Data3!$B6))","v":{"$error":"#N/A"}},{"$f":"CHOOSE(LoadSel,IF(ISBLANK(Data3!$C6),NA(),Data3!$C6),IF(ISBLANK(Data3!$D6),NA(),Data3!$D6))","v":{"$error":"#N/A"}},{"$f":"IF(Data3!testType=\"COMP+REB\", IF(ISBLANK(Data3!D6), NA(), Data3!D6), NA())","v":{"$error":"#N/A"}},{"$f":"CHOOSE(DistSel,IF(ISBLANK(Data4!$A6),NA(),Data4!$A6),IF(ISBLANK(Data4!$B6),NA(),Data4!$B6))","v":{"$error":"#N/A"}},{"$f":"CHOOSE(LoadSel,IF(ISBLANK(Data4!$C6),NA(),Data4!$C6),IF(ISBLANK(Data4!$D6),NA(),Data4!$D6))","v":{"$error":"#N/A"}},{"$f":"IF(Data4!testType=\"COMP+REB\", IF(ISBLANK(Data4!D6), NA(), Data4!D6), NA())","v":{"$error":"#N/A"}}]
[{"$f":"CHOOSE(DistSel,IF(ISBLANK(Data1!$A7),NA(),Data1!$A7),IF(ISBLANK(Data1!$B7),NA(),Data1!$B7))","v":{"$error":"#N/A"}},{"$f":"CHOOSE(LoadSel,IF(ISBLANK(Data1!$C7),NA(),Data1!$C7),IF(ISBLANK(Data1!$D7),NA(),Data1!$D7))","v":{"$error":"#N/A"}},{"$f":"IF(Data1!testType=\"COMP+REB\", IF(ISBLANK(Data1!D7), NA(), Data1!D7), NA())","v":{"$error":"#N/A"}},{"$f":"CHOOSE(DistSel,IF(ISBLANK(Data2!$A7),NA(),Data2!$A7),IF(ISBLANK(Data2!$B7),NA(),Data2!$B7))","v":{"$error":"#N/A"}},{"$f":"CHOOSE(LoadSel,IF(ISBLANK(Data2!$C7),NA(),Data2!$C7),IF(ISBLANK(Data2!$D7),NA(),Data2!$D7))","v":{"$error":"#N/A"}},{"$f":"IF(Data2!testType=\"COMP+REB\", IF(ISBLANK(Data2!D7), NA(), Data2!D7), NA())","v":{"$error":"#N/A"}},{"$f":"CHOOSE(DistSel,IF(ISBLANK(Data3!$A7),NA(),Data3!$A7),IF(ISBLANK(Data3!$B7),NA(),Data3!$B7))","v":{"$error":"#N/A"}},{"$f":"CHOOSE(LoadSel,IF(ISBLANK(Data3!$C7),NA(),Data3!$C7),IF(ISBLANK(Data3!$D7),NA(),Data3!$D7))","v":{"$error":"#N/A"}},{"$f":"IF(Data3!testType=\"COMP+REB\", IF(ISBLANK(Data3!D7), NA(), Data3!D7), NA())","v":{"$error":"#N/A"}},{"$f":"CHOOSE(DistSel,IF(ISBLANK(Data4!$A7),NA(),Data4!$A7),IF(ISBLANK(Data4!$B7),NA(),Data4!$B7))","v":{"$error":"#N/A"}},{"$f":"CHOOSE(LoadSel,IF(ISBLANK(Data4!$C7),NA(),Data4!$C7),IF(ISBLANK(Data4!$D7),NA(),Data4!$D7))","v":{"$error":"#N/A"}},{"$f":"IF(Data4!testType=\"COMP+REB\", IF(ISBLANK(Data4!D7), NA(), Data4!D7), NA())","v":{"$error":"#N/A"}}]
[{"$f":"CHOOSE(DistSel,IF(ISBLANK(Data1!$A8),NA(),Data1!$A8),IF(ISBLANK(Data1!$B8),NA(),Data1!$B8))","v":{"$error":"#N/A"}},{"$f":"CHOOSE(LoadSel,IF(ISBLANK(Data1!$C8),NA(),Data1!$C8),IF(ISBLANK(Data1!$D8),NA(),Data1!$D8))","v":{"$error":"#N/A"}},{"$f":"IF(Data1!testType=\"COMP+REB\", IF(ISBLANK(Data1!D8), NA(), Data1!D8), NA())","v":{"$error":"#N/A"}},{"$f":"CHOOSE(DistSel,IF(ISBLANK(Data2!$A8),NA(),Data2!$A8),IF(ISBLANK(Data2!$B8),NA(),Data2!$B8))","v":{"$error":"#N/A"}},{"$f":"CHOOSE(LoadSel,IF(ISBLANK(Data2!$C8),NA(),Data2!$C8),IF(ISBLANK(Data2!$D8),NA(),Data2!$D8))","v":{"$error":"#N/A"}},{"$f":"IF(Data2!testType=\"COMP+REB\", IF(ISBLANK(Data2!D8), NA(), Data2!D8), NA())","v":{"$error":"#N/A"}},{"$f":"CHOOSE(DistSel,IF(ISBLANK(Data3!$A8),NA(),Data3!$A8),IF(ISBLANK(Data3!$B8),NA(),Data3!$B8))","v":{"$error":"#N/A"}},{"$f":"CHOOSE(LoadSel,IF(ISBLANK(Data3!$C8),NA(),Data3!$C8),IF(ISBLANK(Data3!$D8),NA(),Data3!$D8))","v":{"$error":"#N/A"}},{"$f":"IF(Data3!testType=\"COMP+REB\", IF(ISBLANK(Data3!D8), NA(), Data3!D8), NA())","v":{"$error":"#N/A"}},{"$f":"CHOOSE(DistSel,IF(ISBLANK(Data4!$A8),NA(),Data4!$A8),IF(ISBLANK(Data4!$B8),NA(),Data4!$B8))","v":{"$error":"#N/A"}},{"$f":"CHOOSE(LoadSel,IF(ISBLANK(Data4!$C8),NA(),Data4!$C8),IF(ISBLANK(Data4!$D8),NA(),Data4!$D8))","v":{"$error":"#N/A"}},{"$f":"IF(Data4!testType=\"COMP+REB\", IF(ISBLANK(Data4!D8), NA(), Data4!D8), NA())","v":{"$error":"#N/A"}}]
[{"$f":"CHOOSE(DistSel,IF(ISBLANK(Data1!$A9),NA(),Data1!$A9),IF(ISBLANK(Data1!$B9),NA(),Data1!$B9))","v":{"$error":"#N/A"}},{"$f":"CHOOSE(LoadSel,IF(ISBLANK(Data1!$C9),NA(),Data1!$C9),IF(ISBLANK(Data1!$D9),NA(),Data1!$D9))","v":{"$error":"#N/A"}},{"$f":"IF(Data1!testType=\"COMP+REB\", IF(ISBLANK(Data1!D9), NA(), Data1!D9), NA())","v":{"$error":"#N/A"}},{"$f":"CHOOSE(DistSel,IF(ISBLANK(Data2!$A9),NA(),Data2!$A9),IF(ISBLANK(Data2!$B9),NA(),Data2!$B9))","v":{"$error":"#N/A"}},{"$f":"CHOOSE(LoadSel,IF(ISBLANK(Data2!$C9),NA(),Data2!$C9),IF(ISBLANK(Data2!$D9),NA(),Data2!$D9))","v":{"$error":"#N/A"}},{"$f":"IF(Data2!testType=\"COMP+REB\", IF(ISBLANK(Data2!D9), NA(), Data2!D9), NA())","v":{"$error":"#N/A"}},{"$f":"CHOOSE(DistSel,IF(ISBLANK(Data3!$A9),NA(),Data3!$A9),IF(ISBLANK(Data3!$B9),NA(),Data3!$B9))","v":{"$error":"#N/A"}},{"$f":"CHOOSE(LoadSel,IF(ISBLANK(Data3!$C9),NA(),Data3!$C9),IF(ISBLANK(Data3!$D9),NA(),Data3!$D9))","v":{"$error":"#N/A"}},{"$f":"IF(Data3!testType=\"COMP+REB\", IF(ISBLANK(Data3!D9), NA(), Data3!D9), NA())","v":{"$error":"#N/A"}},{"$f":"CHOOSE(DistSel,IF(ISBLANK(Data4!$A9),NA(),Data4!$A9),IF(ISBLANK(Data4!$B9),NA(),Data4!$B9))","v":{"$error":"#N/A"}},{"$f":"CHOOSE(LoadSel,IF(ISBLANK(Data4!$C9),NA(),Data4!$C9),IF(ISBLANK(Data4!$D9),NA(),Data4!$D9))","v":{"$error":"#N/A"}},{"$f":"IF(Data4!testType=\"COMP+REB\", IF(ISBLANK(Data4!D9), NA(), Data4!D9), NA())","v":{"$error":"#N/A"}}]
[{"$f":"CHOOSE(DistSel,IF(ISBLANK(Data1!$A10),NA(),Data1!$A10),IF(ISBLANK(Data1!$B10),NA(),Data1!$B10))","v":{"$error":"#N/A"}},{"$f":"CHOOSE(LoadSel,IF(ISBLANK(Data1!$C10),NA(),Data1!$C10),IF(ISBLANK(Data1!$D10),NA(),Data1!$D10))","v":{"$error":"#N/A"}},{"$f":"IF(Data1!testType=\"COMP+REB\", IF(ISBLANK(Data1!D10), NA(), Data1!D10), NA())","v":{"$error":"#N/A"}},{"$f":"CHOOSE(DistSel,IF(ISBLANK(Data2!$A10),NA(),Data2!$A10),IF(ISBLANK(Data2!$B10),NA(),Data2!$B10))","v":{"$error":"#N/A"}},{"$f":"CHOOSE(LoadSel,IF(ISBLANK(Data2!$C10),NA(),Data2!$C10),IF(ISBLANK(Data2!$D10),NA(),Data2!$D10))","v":{"$error":"#N/A"}},{"$f":"IF(Data2!testType=\"COMP+REB\", IF(ISBLANK(Data2!D10), NA(), Data2!D10), NA())","v":{"$error":"#N/A"}},{"$f":"CHOOSE(DistSel,IF(ISBLANK(Data3!$A10),NA(),Data3!$A10),IF(ISBLANK(Data3!$B10),NA(),Data3!$B10))","v":{"$error":"#N/A"}},{"$f":"CHOOSE(LoadSel,IF(ISBLANK(Data3!$C10),NA(),Data3!$C10),IF(ISBLANK(Data3!$D10),NA(),Data3!$D10))","v":{"$error":"#N/A"}},{"$f":"IF(Data3!testType=\"COMP+REB\", IF(ISBLANK(Data3!D10), NA(), Data3!D10), NA())","v":{"$error":"#N/A"}},{"$f":"CHOOSE(DistSel,IF(ISBLANK(Data4!$A10),NA(),Data4!$A10),IF(ISBLANK(Data4!$B10),NA(),Data4!$B10))","v":{"$error":"#N/A"}},{"$f":"CHOOSE(LoadSel,IF(ISBLANK(Data4!$C10),NA(),Data4!$C10),IF(ISBLANK(Data4!$D10),NA(),Data4!$D10))","v":{"$error":"#N/A"}},{"$f":"IF(Data4!testType=\"COMP+REB\", IF(ISBLANK(Data4!D10), NA(), Data4!D10), NA())","v":{"$error":"#N/A"}}]
[{"$f":"CHOOSE(DistSel,IF(ISBLANK(Data1!$A11),NA(),Data1!$A11),IF(ISBLANK(Data1!$B11),NA(),Data1!$B11))","v":{"$error":"#N/A"}},{"$f":"CHOOSE(LoadSel,IF(ISBLANK(Data1!$C11),NA(),Data1!$C11),IF(ISBLANK(Data1!$D11),NA(),Data1!$D11))","v":{"$error":"#N/A"}},{"$f":"IF(Data1!testType=\"COMP+REB\", IF(ISBLANK(Data1!D11), NA(), Data1!D11), NA())","v":{"$error":"#N/A"}},{"$f":"CHOOSE(DistSel,IF(ISBLANK(Data2!$A11),NA(),Data2!$A11),IF(ISBLANK(Data2!$B11),NA(),Data2!$B11))","v":{"$error":"#N/A"}},{"$f":"CHOOSE(LoadSel,IF(ISBLANK(Data2!$C11),NA(),Data2!$C11),IF(ISBLANK(Data2!$D11),NA(),Data2!$D11))","v":{"$error":"#N/A"}},{"$f":"IF(Data2!testType=\"COMP+REB\", IF(ISBLANK(Data2!D11), NA(), Data2!D11), NA())","v":{"$error":"#N/A"}},{"$f":"CHOOSE(DistSel,IF(ISBLANK(Data3!$A11),NA(),Data3!$A11),IF(ISBLANK(Data3!$B11),NA(),Data3!$B11))","v":{"$error":"#N/A"}},{"$f":"CHOOSE(LoadSel,IF(ISBLANK(Data3!$C11),NA(),Data3!$C11),IF(ISBLANK(Data3!$D11),NA(),Data3!$D11))","v":{"$error":"#N/A"}},{"$f":"IF(Data3!testType=\"COMP+REB\", IF(ISBLANK(Data3!D11), NA(), Data3!D11), NA())","v":{"$error":"#N/A"}},{"$f":"CHOOSE(DistSel,IF(ISBLANK(Data4!$A11),NA(),Data4!$A11),IF(ISBLANK(Data4!$B11),NA(),Data4!$B11))","v":{"$error":"#N/A"}},{"$f":"CHOOSE(LoadSel,IF(ISBLANK(Data4!$C11),NA(),Data4!$C11),IF(ISBLANK(Data4!$D11),NA(),Data4!$D11))","v":{"$error":"#N/A"}},{"$f":"IF(Data4!testType=\"COMP+REB\", IF(ISBLANK(Data4!D11), NA(), Data4!D11), NA())","v":{"$error":"#N/A"}}]
[{"$f":"CHOOSE(DistSel,IF(ISBLANK(Data1!$A12),NA(),Data1!$A12),IF(ISBLANK(Data1!$B12),NA(),Data1!$B12))","v":{"$error":"#N/A"}},{"$f":"CHOOSE(LoadSel,IF(ISBLANK(Data1!$C12),NA(),Data1!$C12),IF(ISBLANK(Data1!$D12),NA(),Data1!$D12))","v":{"$error":"#N/A"}},{"$f":"IF(Data1!testType=\"COMP+REB\", IF(ISBLANK(Data1!D12), NA(), Data1!D12), NA())","v":{"$error":"#N/A"}},{"$f":"CHOOSE(DistSel,IF(ISBLANK(Data2!$A12),NA(),Data2!$A12),IF(ISBLANK(Data2!$B12),NA(),Data2!$B12))","v":{"$error":"#N/A"}},{"$f":"CHOOSE(LoadSel,IF(ISBLANK(Data2!$C12),NA(),Data2!$C12),IF(ISBLANK(Data2!$D12),NA(),Data2!$D12))","v":{"$error":"#N/A"}},{"$f":"IF(Data2!testType=\"COMP+REB\", IF(ISBLANK(Data2!D12), NA(), Data2!D12), NA())","v":{"$error":"#N/A"}},{"$f":"CHOOSE(DistSel,IF(ISBLANK(Data3!$A12),NA(),Data3!$A12),IF(ISBLANK(Data3!$B12),NA(),Data3!$B12))","v":{"$error":"#N/A"}},{"$f":"CHOOSE(LoadSel,IF(ISBLANK(Data3!$C12),NA(),Data3!$C12),IF(ISBLANK(Data3!$D12),NA(),Data3!$D12))","v":{"$error":"#N/A"}},{"$f":"IF(Data3!testType=\"COMP+REB\", IF(ISBLANK(Data3!D12), NA(), Data3!D12), NA())","v":{"$error":"#N/A"}},{"$f":"CHOOSE(DistSel,IF(ISBLANK(Data4!$A12),NA(),Data4!$A12),IF(ISBLANK(Data4!$B12),NA(),Data4!$B12))","v":{"$error":"#N/A"}},{"$f":"CHOOSE(LoadSel,IF(ISBLANK(Data4!$C12),NA(),Data4!$C12),IF(ISBLANK(Data4!$D12),NA(),Data4!$D12))","v":{"$error":"#N/A"}},{"$f":"IF(Data4!testType=\"COMP+REB\", IF(ISBLANK(Data4!D12), NA(), Data4!D12), NA())","v":{"$error":"#N/A"}}]
[{"$f":"CHOOSE(DistSel,IF(ISBLANK(Data1!$A13),NA(),Data1!$A13),IF(ISBLANK(Data1!$B13),NA(),Data1!$B13))","v":{"$error":"#N/A"}},{"$f":"CHOOSE(LoadSel,IF(ISBLANK(Data1!$C13),NA(),Data1!$C13),IF(ISBLANK(Data1!$D13),NA(),Data1!$D13))","v":{"$error":"#N/A"}},{"$f":"IF(Data1!testType=\"COMP+REB\", IF(ISBLANK(Data1!D13), NA(), Data1!D13), NA())","v":{"$error":"#N/A"}},{"$f":"CHOOSE(DistSel,IF(ISBLANK(Data2!$A13),NA(),Data2!$A13),IF(ISBLANK(Data2!$B13),NA(),Data2!$B13))","v":{"$error":"#N/A"}},{"$f":"CHOOSE(LoadSel,IF(ISBLANK(Data2!$C13),NA(),Data2!$C13),IF(ISBLANK(Data2!$D13),NA(),Data2!$D13))","v":{"$error":"#N/A"}},{"$f":"IF(Data2!testType=\"COMP+REB\", IF(ISBLANK(Data2!D13), NA(), Data2!D13), NA())","v":{"$error":"#N/A"}},{"$f":"CHOOSE(DistSel,IF(ISBLANK(Data3!$A13),NA(),Data3!$A13),IF(ISBLANK(Data3!$B13),NA(),Data3!$B13))","v":{"$error":"#N/A"}},{"$f":"CHOOSE(LoadSel,IF(ISBLANK(Data3!$C13),NA(),Data3!$C13),IF(ISBLANK(Data3!$D13),NA(),Data3!$D13))","v":{"$error":"#N/A"}},{"$f":"IF(Data3!testType=\"COMP+REB\", IF(ISBLANK(Data3!D13), NA(), Data3!D13), NA())","v":{"$error":"#N/A"}},{"$f":"CHOOSE(DistSel,IF(ISBLANK(Data4!$A13),NA(),Data4!$A13),IF(ISBLANK(Data4!$B13),NA(),Data4!$B13))","v":{"$error":"#N/A"}},{"$f":"CHOOSE(LoadSel,IF(ISBLANK(Data4!$C13),NA(),Data4!$C13),IF(ISBLANK(Data4!$D13),NA(),Data4!$D13))","v":{"$error":"#N/A"}},{"$f":"IF(Data4!testType=\"COMP+REB\", IF(ISBLANK(Data4!D13), NA(), Data4!D13), NA())","v":{"$error":"#N/A"}}]
[{"$f":"CHOOSE(DistSel,IF(ISBLANK(Data1!$A14),NA(),Data1!$A14),IF(ISBLANK(Data1!$B14),NA(),Data1!$B14))","v":{"$error":"#N/A"}},{"$f":"CHOOSE(LoadSel,IF(ISBLANK(Data1!$C14),NA(),Data1!$C14),IF(ISBLANK(Data1!$D14),NA(),Data1!$D14))","v":{"$error":"#N/A"}},{"$f":"IF(Data1!testType=\"COMP+REB\", IF(ISBLANK(Data1!D14), NA(), Data1!D14), NA())","v":{"$error":"#N/A"}},{"$f":"CHOOSE(DistSel,IF(ISBLANK(Data2!$A14),NA(),Data2!$A14),IF(ISBLANK(Data2!$B14),NA(),Data2!$B14))","v":{"$error":"#N/A"}},{"$f":"CHOOSE(LoadSel,IF(ISBLANK(Data2!$C14),NA(),Data2!$C14),IF(ISBLANK(Data2!$D14),NA(),Data2!$D14))","v":{"$error":"#N/A"}},{"$f":"IF(Data2!testType=\"COMP+REB\", IF(ISBLANK(Data2!D14), NA(), Data2!D14), NA())","v":{"$error":"#N/A"}},{"$f":"CHOOSE(DistSel,IF(ISBLANK(Data3!$A14),NA(),Data3!$A14),IF(ISBLANK(Data3!$B14),NA(),Data3!$B14))","v":{"$error":"#N/A"}},{"$f":"CHOOSE(LoadSel,IF(ISBLANK(Data3!$C14),NA(),Data3!$C14),IF(ISBLANK(Data3!$D14),NA(),Data3!$D14))","v":{"$error":"#N/A"}},{"$f":"IF(Data3!testType=\"COMP+REB\", IF(ISBLANK(Data3!D14), NA(), Data3!D14), NA())","v":{"$error":"#N/A"}},{"$f":"CHOOSE(DistSel,IF(ISBLANK(Data4!$A14),NA(),Data4!$A14),IF(ISBLANK(Data4!$B14),NA(),Data4!$B14))","v":{"$error":"#N/A"}},{"$f":"CHOOSE(LoadSel,IF(ISBLANK(Data4!$C14),NA(),Data4!$C14),IF(ISBLANK(Data4!$D14),NA(),Data4!$D14))","v":{"$error":"#N/A"}},{"$f":"IF(Data4!testType=\"COMP+REB\", IF(ISBLANK(Data4!D14), NA(), Data4!D14), NA())","v":{"$error":"#N/A"}}]
[{"$f":"CHOOSE(DistSel,IF(ISBLANK(Data1!$A15),NA(),Data1!$A15),IF(ISBLANK(Data1!$B15),NA(),Data1!$B15))","v":{"$error":"#N/A"}},{"$f":"CHOOSE(LoadSel,IF(ISBLANK(Data1!$C15),NA(),Data1!$C15),IF(ISBLANK(Data1!$D15),NA(),Data1!$D15))","v":{"$error":"#N/A"}},{"$f":"IF(Data1!testType=\"COMP+REB\", IF(ISBLANK(Data1!D15), NA(), Data1!D15), NA())","v":{"$error":"#N/A"}},{"$f":"CHOOSE(DistSel,IF(ISBLANK(Data2!$A15),NA(),Data2!$A15),IF(ISBLANK(Data2!$B15),NA(),Data2!$B15))","v":{"$error":"#N/A"}},{"$f":"CHOOSE(LoadSel,IF(ISBLANK(Data2!$C15),NA(),Data2!$C15),IF(ISBLANK(Data2!$D15),NA(),Data2!$D15))","v":{"$error":"#N/A"}},{"$f":"IF(Data2!testType=\"COMP+REB\", IF(ISBLANK(Data2!D15), NA(), Data2!D15), NA())","v":{"$error":"#N/A"}},{"$f":"CHOOSE(DistSel,IF(ISBLANK(Data3!$A15),NA(),Data3!$A15),IF(ISBLANK(Data3!$B15),NA(),Data3!$B15))","v":{"$error":"#N/A"}},{"$f":"CHOOSE(LoadSel,IF(ISBLANK(Data3!$C15),NA(),Data3!$C15),IF(ISBLANK(Data3!$D15),NA(),Data3!$D15))","v":{"$error":"#N/A"}},{"$f":"IF(Data3!testType=\"COMP+REB\", IF(ISBLANK(Data3!D15), NA(), Data3!D15), NA())","v":{"$error":"#N/A"}},{"$f":"CHOOSE(DistSel,IF(ISBLANK(Data4!$A15),NA(),Data4!$A15),IF(ISBLANK(Data4!$B15),NA(),Data4!$B15))","v":{"$error":"#N/A"}},{"$f":"CHOOSE(LoadSel,IF(ISBLANK(Data4!$C15),NA(),Data4!$C15),IF(ISBLANK(Data4!$D15),NA(),Data4!$D15))","v":{"$error":"#N/A"}},{"$f":"IF(Data4!testType=\"COMP+REB\", IF(ISBLANK(Data4!D15), NA(), Data4!D15), NA())","v":{"$error":"#N/A"}}]
[{"$f":"CHOOSE(DistSel,IF(ISBLANK(Data1!$A16),NA(),Data1!$A16),IF(ISBLANK(Data1!$B16),NA(),Data1!$B16))","v":{"$error":"#N/A"}},{"$f":"CHOOSE(LoadSel,IF(ISBLANK(Data1!$C16),NA(),Data1!$C16),IF(ISBLANK(Data1!$D16),NA(),Data1!$D16))","v":{"$error":"#N/A"}},{"$f":"IF(Data1!testType=\"COMP+REB\", IF(ISBLANK(Data1!D16), NA(), Data1!D16), NA())","v":{"$error":"#N/A"}},{"$f":"CHOOSE(DistSel,IF(ISBLANK(Data2!$A16),NA(),Data2!$A16),IF(ISBLANK(Data2!$B16),NA(),Data2!$B16))","v":{"$error":"#N/A"}},{"$f":"CHOOSE(LoadSel,IF(ISBLANK(Data2!$C16),NA(),Data2!$C16),IF(ISBLANK(Data2!$D16),NA(),Data2!$D16))","v":{"$error":"#N/A"}},{"$f":"IF(Data2!testType=\"COMP+REB\", IF(ISBLANK(Data2!D16), NA(), Data2!D16), NA())","v":{"$error":"#N/A"}},{"$f":"CHOOSE(DistSel,IF(ISBLANK(Data3!$A16),NA(),Data3!$A16),IF(ISBLANK(Data3!$B16),NA(),Data3!$B16))","v":{"$error":"#N/A"}},{"$f":"CHOOSE(LoadSel,IF(ISBLANK(Data3!$C16),NA(),Data3!$C16),IF(ISBLANK(Data3!$D16),NA(),Data3!$D16))","v":{"$error":"#N/A"}},{"$f":"IF(Data3!testType=\"COMP+REB\", IF(ISBLANK(Data3!D16), NA(), Data3!D16), NA())","v":{"$error":"#N/A"}},{"$f":"CHOOSE(DistSel,IF(ISBLANK(Data4!$A16),NA(),Data4!$A16),IF(ISBLANK(Data4!$B16),NA(),Data4!$B16))","v":{"$error":"#N/A"}},{"$f":"CHOOSE(LoadSel,IF(ISBLANK(Data4!$C16),NA(),Data4!$C16),IF(ISBLANK(Data4!$D16),NA(),Data4!$D16))","v":{"$error":"#N/A"}},{"$f":"IF(Data4!testType=\"COMP+REB\", IF(ISBLANK(Data4!D16), NA(), Data4!D16), NA())","v":{"$error":"#N/A"}}]
[{"$f":"CHOOSE(DistSel,IF(ISBLANK(Data1!$A17),NA(),Data1!$A17),IF(ISBLANK(Data1!$B17),NA(),Data1!$B17))","v":{"$error":"#N/A"}},{"$f":"CHOOSE(LoadSel,IF(ISBLANK(Data1!$C17),NA(),Data1!$C17),IF(ISBLANK(Data1!$D17),NA(),Data1!$D17))","v":{"$error":"#N/A"}},{"$f":"IF(Data1!testType=\"COMP+REB\", IF(ISBLANK(Data1!D17), NA(), Data1!D17), NA())","v":{"$error":"#N/A"}},{"$f":"CHOOSE(DistSel,IF(ISBLANK(Data2!$A17),NA(),Data2!$A17),IF(ISBLANK(Data2!$B17),NA(),Data2!$B17))","v":{"$error":"#N/A"}},{"$f":"CHOOSE(LoadSel,IF(ISBLANK(Data2!$C17),NA(),Data2!$C17),IF(ISBLANK(Data2!$D17),NA(),Data2!$D17))","v":{"$error":"#N/A"}},{"$f":"IF(Data2!testType=\"COMP+REB\", IF(ISBLANK(Data2!D17), NA(), Data2!D17), NA())","v":{"$error":"#N/A"}},{"$f":"CHOOSE(DistSel,IF(ISBLANK(Data3!$A17),NA(),Data3!$A17),IF(ISBLANK(Data3!$B17),NA(),Data3!$B17))","v":{"$error":"#N/A"}},{"$f":"CHOOSE(LoadSel,IF(ISBLANK(Data3!$C17),NA(),Data3!$C17),IF(ISBLANK(Data3!$D17),NA(),Data3!$D17))","v":{"$error":"#N/A"}},{"$f":"IF(Data3!testType=\"COMP+REB\", IF(ISBLANK(Data3!D17), NA(), Data3!D17), NA())","v":{"$error":"#N/A"}},{"$f":"CHOOSE(DistSel,IF(ISBLANK(Data4!$A17),NA(),Data4!$A17),IF(ISBLANK(Data4!$B17),NA(),Data4!$B17))","v":{"$error":"#N/A"}},{"$f":"CHOOSE(LoadSel,IF(ISBLANK(Data4!$C17),NA(),Data4!$C17),IF(ISBLANK(Data4!$D17),NA(),Data4!$D17))","v":{"$error":"#N/A"}},{"$f":"IF(Data4!testType=\"COMP+REB\", IF(ISBLANK(Data4!D17), NA(), Data4!D17), NA())","v":{"$error":"#N/A"}}]
[{"$f":"CHOOSE(DistSel,IF(ISBLANK(Data1!$A18),NA(),Data1!$A18),IF(ISBLANK(Data1!$B18),NA(),Data1!$B18))","v":{"$error":"#N/A"}},{"$f":"CHOOSE(LoadSel,IF(ISBLANK(Data1!$C18),NA(),Data1!$C18),IF(ISBLANK(Data1!$D18),NA(),Data1!$D18))","v":{"$error":"#N/A"}},{"$f":"IF(Data1!testType=\"COMP+REB\", IF(ISBLANK(Data1!D18), NA(), Data1!D18), NA())","v":{"$error":"#N/A"}},{"$f":"CHOOSE(DistSel,IF(ISBLANK(Data2!$A18),NA(),Data2!$A18),IF(ISBLANK(Data2!$B18),NA(),Data2!$B18))","v":{"$error":"#N/A"}},{"$f":"CHOOSE(LoadSel,IF(ISBLANK(Data2!$C18),NA(),Data2!$C18),IF(ISBLANK(Data2!$D18),NA(),Data2!$D18))","v":{"$error":"#N/A"}},{"$f":"IF(Data2!testType=\"COMP+REB\", IF(ISBLANK(Data2!D18), NA(), Data2!D18), NA())","v":{"$error":"#N/A"}},{"$f":"CHOOSE(DistSel,IF(ISBLANK(Data3!$A18),NA(),Data3!$A18),IF(ISBLANK(Data3!$B18),NA(),Data3!$B18))","v":{"$error":"#N/A"}},{"$f":"CHOOSE(LoadSel,IF(ISBLANK(Data3!$C18),NA(),Data3!$C18),IF(ISBLANK(Data3!$D18),NA(),Data3!$D18))","v":{"$error":"#N/A"}},{"$f":"IF(Data3!testType=\"COMP+REB\", IF(ISBLANK(Data3!D18), NA(), Data3!D18), NA())","v":{"$error":"#N/A"}},{"$f":"CHOOSE(DistSel,IF(ISBLANK(Data4!$A18),NA(),Data4!$A18),IF(ISBLANK(Data4!$B18),NA(),Data4!$B18))","v":{"$error":"#N/A"}},{"$f":"CHOOSE(LoadSel,IF(ISBLANK(Data4!$C18),NA(),Data4!$C18),IF(ISBLANK(Data4!$D18),NA(),Data4!$D18))","v":{"$error":"#N/A"}},{"$f":"IF(Data4!testType=\"COMP+REB\", IF(ISBLANK(Data4!D18), NA(), Data4!D18), NA())","v":{"$error":"#N/A"}}]
[{"$f":"CHOOSE(DistSel,IF(ISBLANK(Data1!$A19),NA(),Data1!$A19),IF(ISBLANK(Data1!$B19),NA(),Data1!$B19))","v":{"$error":"#N/A"}},{"$f":"CHOOSE(LoadSel,IF(ISBLANK(Data1!$C19),NA(),Data1!$C19),IF(ISBLANK(Data1!$D19),NA(),Data1!$D19))","v":{"$error":"#N/A"}},{"$f":"IF(Data1!testType=\"COMP+REB\", IF(ISBLANK(Data1!D19), NA(), Data1!D19), NA())","v":{"$error":"#N/A"}},{"$f":"CHOOSE(DistSel,IF(ISBLANK(Data2!$A19),NA(),Data2!$A19),IF(ISBLANK(Data2!$B19),NA(),Data2!$B19))","v":{"$error":"#N/A"}},{"$f":"CHOOSE(LoadSel,IF(ISBLANK(Data2!$C19),NA(),Data2!$C19),IF(ISBLANK(Data2!$D19),NA(),Data2!$D19))","v":{"$error":"#N/A"}},{"$f":"IF(Data2!testType=\"COMP+REB\", IF(ISBLANK(Data2!D19), NA(), Data2!D19), NA())","v":{"$error":"#N/A"}},{"$f":"CHOOSE(DistSel,IF(ISBLANK(Data3!$A19),NA(),Data3!$A19),IF(ISBLANK(Data3!$B19),NA(),Data3!$B19))","v":{"$error":"#N/A"}},{"$f":"CHOOSE(LoadSel,IF(ISBLANK(Data3!$C19),NA(),Data3!$C19),IF(ISBLANK(Data3!$D19),NA(),Data3!$D19))","v":{"$error":"#N/A"}},{"$f":"IF(Data3!testType=\"COMP+REB\", IF(ISBLANK(Data3!D19), NA(), Data3!D19), NA())","v":{"$error":"#N/A"}},{"$f":"CHOOSE(DistSel,IF(ISBLANK(Data4!$A19),NA(),Data4!$A19),IF(ISBLANK(Data4!$B19),NA(),Data4!$B19))","v":{"$error":"#N/A"}},{"$f":"CHOOSE(LoadSel,IF(ISBLANK(Data4!$C19),NA(),Data4!$C19),IF(ISBLANK(Data4!$D19),NA(),Data4!$D19))","v":{"$error":"#N/A"}},{"$f":"IF(Data4!testType=\"COMP+REB\", IF(ISBLANK(Data4!D19), NA(), Data4!D19), NA())","v":{"$error":"#N/A"}}]
[{"$f":"CHOOSE(DistSel,IF(ISBLANK(Data1!$A20),NA(),Data1!$A20),IF(ISBLANK(Data1!$B20),NA(),Data1!$B20))","v":{"$error":"#N/A"}},{"$f":"CHOOSE(LoadSel,IF(ISBLANK(Data1!$C20),NA(),Data1!$C20),IF(ISBLANK(Data1!$D20),NA(),Data1!$D20))","v":{"$error":"#N/A"}},{"$f":"IF(Data1!testType=\"COMP+REB\", IF(ISBLANK(Data1!D20), NA(), Data1!D20), NA())","v":{"$error":"#N/A"}},{"$f":"CHOOSE(DistSel,IF(ISBLANK(Data2!$A20),NA(),Data2!$A20),IF(ISBLANK(Data2!$B20),NA(),Data2!$B20))","v":{"$error":"#N/A"}},{"$f":"CHOOSE(LoadSel,IF(ISBLANK(Data2!$C20),NA(),Data2!$C20),IF(ISBLANK(Data2!$D20),NA(),Data2!$D20))","v":{"$error":"#N/A"}},{"$f":"IF(Data2!testType=\"COMP+REB\", IF(ISBLANK(Data2!D20), NA(), Data2!D20), NA())","v":{"$error":"#N/A"}},{"$f":"CHOOSE(DistSel,IF(ISBLANK(Data3!$A20),NA(),Data3!$A20),IF(ISBLANK(Data3!$B20),NA(),Data3!$B20))","v":{"$error":"#N/A"}},{"$f":"CHOOSE(LoadSel,IF(ISBLANK(Data3!$C20),NA(),Data3!$C20),IF(ISBLANK(Data3!$D20),NA(),Data3!$D20))","v":{"$error":"#N/A"}},{"$f":"IF(Data3!testType=\"COMP+REB\", IF(ISBLANK(Data3!D20), NA(), Data3!D20), NA())","v":{"$error":"#N/A"}},{"$f":"CHOOSE(DistSel,IF(ISBLANK(Data4!$A20),NA(),Data4!$A20),IF(ISBLANK(Data4!$B20),NA(),Data4!$B20))","v":{"$error":"#N/A"}},{"$f":"CHOOSE(LoadSel,IF(ISBLANK(Data4!$C20),NA(),Data4!$C20),IF(ISBLANK(Data4!$D20),NA(),Data4!$D20))","v":{"$error":"#N/A"}},{"$f":"IF(Data4!testType=\"COMP+REB\", IF(ISBLANK(Data4!D20), NA(), Data4!D20), NA())","v":{"$error":"#N/A"}}]
[{"$f":"CHOOSE(DistSel,IF(ISBLANK(Data1!$A21),NA(),Data1!$A21),IF(ISBLANK(Data1!$B21),NA(),Data1!$B21))","v":{"$error":"#N/A"}},{"$f":"CHOOSE(LoadSel,IF(ISBLANK(Data1!$C21),NA(),Data1!$C21),IF(ISBLANK(Data1!$D21),NA(),Data1!$D21))","v":{"$error":"#N/A"}},{"$f":"IF(Data1!testType=\"COMP+REB\", IF(ISBLANK(Data1!D21), NA(), Data1!D21), NA())","v":{"$error":"#N/A"}},{"$f":"CHOOSE(DistSel,IF(ISBLANK(Data2!$A21),NA(),Data2!$A21),IF(ISBLANK(Data2!$B21),NA(),Data2!$B21))","v":{"$error":"#N/A"}},{"$f":"CHOOSE(LoadSel,IF(ISBLANK(Data2!$C21),NA(),Data2!$C21),IF(ISBLANK(Data2!$D21),NA(),Data2!$D21))","v":{"$error":"#N/A"}},{"$f":"IF(Data2!testType=\"COMP+REB\", IF(ISBLANK(Data2!D21), NA(), Data2!D21), NA())","v":{"$error":"#N/A"}},{"$f":"CHOOSE(DistSel,IF(ISBLANK(Data3!$A21),NA(),Data3!$A21),IF(ISBLANK(Data3!$B21),NA(),Data3!$B21))","v":{"$error":"#N/A"}},{"$f":"CHOOSE(LoadSel,IF(ISBLANK(Data3!$C21),NA(),Data3!$C21),IF(ISBLANK(Data3!$D21),NA(),Data3!$D21))","v":{"$error":"#N/A"}},{"$f":"IF(Data3!testType=\"COMP+REB\", IF(ISBLANK(Data3!D21), NA(), Data3!D21), NA())","v":{"$error":"#N/A"}},{"$f":"CHOOSE(DistSel,IF(ISBLANK(Data4!$A21),NA(),Data4!$A21),IF(ISBLANK(Data4!$B21),NA(),Data4!$B21))","v":{"$error":"#N/A"}},{"$f":"CHOOSE(LoadSel,IF(ISBLANK(Data4!$C21),NA(),Data4!$C21),IF(ISBLANK(Data4!$D21),NA(),Data4!$D21))","v":{"$error":"#N/A"}},{"$f":"IF(Data4!testType=\"COMP+REB\", IF(ISBLANK(Data4!D21), NA(), Data4!D21), NA())","v":{"$error":"#N/A"}}]
[{"$f":"CHOOSE(DistSel,IF(ISBLANK(Data1!$A22),NA(),Data1!$A22),IF(ISBLANK(Data1!$B22),NA(),Data1!$B22))","v":{"$error":"#N/A"}},{"$f":"CHOOSE(LoadSel,IF(ISBLANK(Data1!$C22),NA(),Data1!$C22),IF(ISBLANK(Data1!$D22),NA(),Data1!$D22))","v":{"$error":"#N/A"}},{"$f":"IF(Data1!testType=\"COMP+REB\", IF(ISBLANK(Data1!D22), NA(), Data1!D22), NA())","v":{"$error":"#N/A"}},{"$f":"CHOOSE(DistSel,IF(ISBLANK(Data2!$A22),NA(),Data2!$A22),IF(ISBLANK(Data2!$B22),NA(),Data2!$B22))","v":{"$error":"#N/A"}},{"$f":"CHOOSE(LoadSel,IF(ISBLANK(Data2!$C22),NA(),Data2!$C22),IF(ISBLANK(Data2!$D22),NA(),Data2!$D22))","v":{"$error":"#N/A"}},{"$f":"IF(Data2!testType=\"COMP+REB\", IF(ISBLANK(Data2!D22), NA(), Data2!D22), NA())","v":{"$error":"#N/A"}},{"$f":"CHOOSE(DistSel,IF(ISBLANK(Data3!$A22),NA(),Data3!$A22),IF(ISBLANK(Data3!$B22),NA(),Data3!$B22))","v":{"$error":"#N/A"}},{"$f":"CHOOSE(LoadSel,IF(ISBLANK(Data3!$C22),NA(),Data3!$C22),IF(ISBLANK(Data3!$D22),NA(),Data3!$D22))","v":{"$error":"#N/A"}},{"$f":"IF(Data3!testType=\"COMP+REB\", IF(ISBLANK(Data3!D22), NA(), Data3!D22), NA())","v":{"$error":"#N/A"}},{"$f":"CHOOSE(DistSel,IF(ISBLANK(Data4!$A22),NA(),Data4!$A22),IF(ISBLANK(Data4!$B22),NA(),Data4!$B22))","v":{"$error":"#N/A"}},{"$f":"CHOOSE(LoadSel,IF(ISBLANK(Data4!$C22),NA(),Data4!$C22),IF(ISBLANK(Data4!$D22),NA(),Data4!$D22))","v":{"$error":"#N/A"}},{"$f":"IF(Data4!testType=\"COMP+REB\", IF(ISBLANK(Data4!D22), NA(), Data4!D22), NA())","v":{"$error":"#N/A"}}]
[{"$f":"CHOOSE(DistSel,IF(ISBLANK(Data1!$A23),NA(),Data1!$A23),IF(ISBLANK(Data1!$B23),NA(),Data1!$B23))","v":{"$error":"#N/A"}},{"$f":"CHOOSE(LoadSel,IF(ISBLANK(Data1!$C23),NA(),Data1!$C23),IF(ISBLANK(Data1!$D23),NA(),Data1!$D23))","v":{"$error":"#N/A"}},{"$f":"IF(Data1!testType=\"COMP+REB\", IF(ISBLANK(Data1!D23), NA(), Data1!D23), NA())","v":{"$error":"#N/A"}},{"$f":"CHOOSE(DistSel,IF(ISBLANK(Data2!$A23),NA(),Data2!$A23),IF(ISBLANK(Data2!$B23),NA(),Data2!$B23))","v":{"$error":"#N/A"}},{"$f":"CHOOSE(LoadSel,IF(ISBLANK(Data2!$C23),NA(),Data2!$C23),IF(ISBLANK(Data2!$D23),NA(),Data2!$D23))","v":{"$error":"#N/A"}},{"$f":"IF(Data2!testType=\"COMP+REB\", IF(ISBLANK(Data2!D23), NA(), Data2!D23), NA())","v":{"$error":"#N/A"}},{"$f":"CHOOSE(DistSel,IF(ISBLANK(Data3!$A23),NA(),Data3!$A23),IF(ISBLANK(Data3!$B23),NA(),Data3!$B23))","v":{"$error":"#N/A"}},{"$f":"CHOOSE(LoadSel,IF(ISBLANK(Data3!$C23),NA(),Data3!$C23),IF(ISBLANK(Data3!$D23),NA(),Data3!$D23))","v":{"$error":"#N/A"}},{"$f":"IF(Data3!testType=\"COMP+REB\", IF(ISBLANK(Data3!D23), NA(), Data3!D23), NA())","v":{"$error":"#N/A"}},{"$f":"CHOOSE(DistSel,IF(ISBLANK(Data4!$A23),NA(),Data4!$A23),IF(ISBLANK(Data4!$B23),NA(),Data4!$B23))","v":{"$error":"#N/A"}},{"$f":"CHOOSE(LoadSel,IF(ISBLANK(Data4!$C23),NA(),Data4!$C23),IF(ISBLANK(Data4!$D23),NA(),Data4!$D23))","v":{"$error":"#N/A"}},{"$f":"IF(Data4!testType=\"COMP+REB\", IF(ISBLANK(Data4!D23), NA(), Data4!D23), NA())","v":{"$error":"#N/A"}}]
[{"$f":"CHOOSE(DistSel,IF(ISBLANK(Data1!$A24),NA(),Data1!$A24),IF(ISBLANK(Data1!$B24),NA(),Data1!$B24))","v":{"$error":"#N/A"}},{"$f":"CHOOSE(LoadSel,IF(ISBLANK(Data1!$C24),NA(),Data1!$C24),IF(ISBLANK(Data1!$D24),NA(),Data1!$D24))","v":{"$error":"#N/A"}},{"$f":"IF(Data1!testType=\"COMP+REB\", IF(ISBLANK(Data1!D24), NA(), Data1!D24), NA())","v":{"$error":"#N/A"}},{"$f":"CHOOSE(DistSel,IF(ISBLANK(Data2!$A24),NA(),Data2!$A24),IF(ISBLANK(Data2!$B24),NA(),Data2!$B24))","v":{"$error":"#N/A"}},{"$f":"CHOOSE(LoadSel,IF(ISBLANK(Data2!$C24),NA(),Data2!$C24),IF(ISBLANK(Data2!$D24),NA(),Data2!$D24))","v":{"$error":"#N/A"}},{"$f":"IF(Data2!testType=\"COMP+REB\", IF(ISBLANK(Data2!D24), NA(), Data2!D24), NA())","v":{"$error":"#N/A"}},{"$f":"CHOOSE(DistSel,IF(ISBLANK(Data3!$A24),NA(),Data3!$A24),IF(ISBLANK(Data3!$B24),NA(),Data3!$B24))","v":{"$error":"#N/A"}},{"$f":"CHOOSE(LoadSel,IF(ISBLANK(Data3!$C24),NA(),Data3!$C24),IF(ISBLANK(Data3!$D24),NA(),Data3!$D24))","v":{"$error":"#N/A"}},{"$f":"IF(Data3!testType=\"COMP+REB\", IF(ISBLANK(Data3!D24), NA(), Data3!D24), NA())","v":{"$error":"#N/A"}},{"$f":"CHOOSE(DistSel,IF(ISBLANK(Data4!$A24),NA(),Data4!$A24),IF(ISBLANK(Data4!$B24),NA(),Data4!$B24))","v":{"$error":"#N/A"}},{"$f":"CHOOSE(LoadSel,IF(ISBLANK(Data4!$C24),NA(),Data4!$C24),IF(ISBLANK(Data4!$D24),NA(),Data4!$D24))","v":{"$error":"#N/A"}},{"$f":"IF(Data4!testType=\"COMP+REB\", IF(ISBLANK(Data4!D24), NA(), Data4!D24), NA())","v":{"$error":"#N/A"}}]
[{"$f":"CHOOSE(DistSel,IF(ISBLANK(Data1!$A25),NA(),Data1!$A25),IF(ISBLANK(Data1!$B25),NA(),Data1!$B25))","v":{"$error":"#N/A"}},{"$f":"CHOOSE(LoadSel,IF(ISBLANK(Data1!$C25),NA(),Data1!$C25),IF(ISBLANK(Data1!$D25),NA(),Data1!$D25))","v":{"$error":"#N/A"}},{"$f":"IF(Data1!testType=\"COMP+REB\", IF(ISBLANK(Data1!D25), NA(), Data1!D25), NA())","v":{"$error":"#N/A"}},{"$f":"CHOOSE(DistSel,IF(ISBLANK(Data2!$A25),NA(),Data2!$A25),IF(ISBLANK(Data2!$B25),NA(),Data2!$B25))","v":{"$error":"#N/A"}},{"$f":"CHOOSE(LoadSel,IF(ISBLANK(Data2!$C25),NA(),Data2!$C25),IF(ISBLANK(Data2!$D25),NA(),Data2!$D25))","v":{"$error":"#N/A"}},{"$f":"IF(Data2!testType=\"COMP+REB\", IF(ISBLANK(Data2!D25), NA(), Data2!D25), NA())","v":{"$error":"#N/A"}},{"$f":"CHOOSE(DistSel,IF(ISBLANK(Data3!$A25),NA(),Data3!$A25),IF(ISBLANK(Data3!$B25),NA(),Data3!$B25))","v":{"$error":"#N/A"}},{"$f":"CHOOSE(LoadSel,IF(ISBLANK(Data3!$C25),NA(),Data3!$C25),IF(ISBLANK(Data3!$D25),NA(),Data3!$D25))","v":{"$error":"#N/A"}},{"$f":"IF(Data3!testType=\"COMP+REB\", IF(ISBLANK(Data3!D25), NA(), Data3!D25), NA())","v":{"$error":"#N/A"}},{"$f":"CHOOSE(DistSel,IF(ISBLANK(Data4!$A25),NA(),Data4!$A25),IF(ISBLANK(Data4!$B25),NA(),Data4!$B25))","v":{"$error":"#N/A"}},{"$f":"CHOOSE(LoadSel,IF(ISBLANK(Data4!$C25),NA(),Data4!$C25),IF(ISBLANK(Data4!$D25),NA(),Data4!$D25))","v":{"$error":"#N/A"}},{"$f":"IF(Data4!testType=\"COMP+REB\", IF(ISBLANK(Data4!D25), NA(), Data4!D25), NA())","v":{"$error":"#N/A"}}]
[{"$f":"CHOOSE(DistSel,IF(ISBLANK(Data1!$A26),NA(),Data1!$A26),IF(ISBLANK(Data1!$B26),NA(),Data1!$B26))","v":{"$error":"#N/A"}},{"$f":"CHOOSE(LoadSel,IF(ISBLANK(Data1!$C26),NA(),Data1!$C26),IF(ISBLANK(Data1!$D26),NA(),Data1!$D26))","v":{"$error":"#N/A"}},{"$f":"IF(Data1!testType=\"COMP+REB\", IF(ISBLANK(Data1!D26), NA(), Data1!D26), NA())","v":{"$error":"#N/A"}},{"$f":"CHOOSE(DistSel,IF(ISBLANK(Data2!$A26),NA(),Data2!$A26),IF(ISBLANK(Data2!$B26),NA(),Data2!$B26))","v":{"$error":"#N/A"}},{"$f":"CHOOSE(LoadSel,IF(ISBLANK(Data2!$C26),NA(),Data2!$C26),IF(ISBLANK(Data2!$D26),NA(),Data2!$D26))","v":{"$error":"#N/A"}},{"$f":"IF(Data2!testType=\"COMP+REB\", IF(ISBLANK(Data2!D26), NA(), Data2!D26), NA())","v":{"$error":"#N/A"}},{"$f":"CHOOSE(DistSel,IF(ISBLANK(Data3!$A26),NA(),Data3!$A26),IF(ISBLANK(Data3!$B26),NA(),Data3!$B26))","v":{"$error":"#N/A"}},{"$f":"CHOOSE(LoadSel,IF(ISBLANK(Data3!$C26),NA(),Data3!$C26),IF(ISBLANK(Data3!$D26),NA(),Data3!$D26))","v":{"$error":"#N/A"}},{"$f":"IF(Data3!testType=\"COMP+REB\", IF(ISBLANK(Data3!D26), NA(), Data3!D26), NA())","v":{"$error":"#N/A"}},{"$f":"CHOOSE(DistSel,IF(ISBLANK(Data4!$A26),NA(),Data4!$A26),IF(ISBLANK(Data4!$B26),NA(),Data4!$B26))","v":{"$error":"#N/A"}},{"$f":"CHOOSE(LoadSel,IF(ISBLANK(Data4!$C26),NA(),Data4!$C26),IF(ISBLANK(Data4!$D26),NA(),Data4!$D26))","v":{"$error":"#N/A"}},{"$f":"IF(Data4!testType=\"COMP+REB\", IF(ISBLANK(Data4!D26), NA(), Data4!D26), NA())","v":{"$error":"#N/A"}}]
[{"$f":"CHOOSE(DistSel,IF(ISBLANK(Data1!$A27),NA(),Data1!$A27),IF(ISBLANK(Data1!$B27),NA(),Data1!$B27))","v":{"$error":"#N/A"}},{"$f":"CHOOSE(LoadSel,IF(ISBLANK(Data1!$C27),NA(),Data1!$C27),IF(ISBLANK(Data1!$D27),NA(),Data1!$D27))","v":{"$error":"#N/A"}},{"$f":"IF(Data1!testType=\"COMP+REB\", IF(ISBLANK(Data1!D27), NA(), Data1!D27), NA())","v":{"$error":"#N/A"}},{"$f":"CHOOSE(DistSel,IF(ISBLANK(Data2!$A27),NA(),Data2!$A27),IF(ISBLANK(Data2!$B27),NA(),Data2!$B27))","v":{"$error":"#N/A"}},{"$f":"CHOOSE(LoadSel,IF(ISBLANK(Data2!$C27),NA(),Data2!$C27),IF(ISBLANK(Data2!$D27),NA(),Data2!$D27))","v":{"$error":"#N/A"}},{"$f":"IF(Data2!testType=\"COMP+REB\", IF(ISBLANK(Data2!D27), NA(), Data2!D27), NA())","v":{"$error":"#N/A"}},{"$f":"CHOOSE(DistSel,IF(ISBLANK(Data3!$A27),NA(),Data3!$A27),IF(ISBLANK(Data3!$B27),NA(),Data3!$B27))","v":{"$error":"#N/A"}},{"$f":"CHOOSE(LoadSel,IF(ISBLANK(Data3!$C27),NA(),Data3!$C27),IF(ISBLANK(Data3!$D27),NA(),Data3!$D27))","v":{"$error":"#N/A"}},{"$f":"IF(Data3!testType=\"COMP+REB\", IF(ISBLANK(Data3!D27), NA(), Data3!D27), NA())","v":{"$error":"#N/A"}},{"$f":"CHOOSE(DistSel,IF(ISBLANK(Data4!$A27),NA(),Data4!$A27),IF(ISBLANK(Data4!$B27),NA(),Data4!$B27))","v":{"$error":"#N/A"}},{"$f":"CHOOSE(LoadSel,IF(ISBLANK(Data4!$C27),NA(),Data4!$C27),IF(ISBLANK(Data4!$D27),NA(),Data4!$D27))","v":{"$error":"#N/A"}},{"$f":"IF(Data4!testType=\"COMP+REB\", IF(ISBLANK(Data4!D27), NA(), Data4!D27), NA())","v":{"$error":"#N/A"}}]
[{"$f":"CHOOSE(DistSel,IF(ISBLANK(Data1!$A28),NA(),Data1!$A28),IF(ISBLANK(Data1!$B28),NA(),Data1!$B28))","v":{"$error":"#N/A"}},{"$f":"CHOOSE(LoadSel,IF(ISBLANK(Data1!$C28),NA(),Data1!$C28),IF(ISBLANK(Data1!$D28),NA(),Data1!$D28))","v":{"$error":"#N/A"}},{"$f":"IF(Data1!testType=\"COMP+REB\", IF(ISBLANK(Data1!D28), NA(), Data1!D28), NA())","v":{"$error":"#N/A"}},{"$f":"CHOOSE(DistSel,IF(ISBLANK(Data2!$A28),NA(),Data2!$A28),IF(ISBLANK(Data2!$B28),NA(),Data2!$B28))","v":{"$error":"#N/A"}},{"$f":"CHOOSE(LoadSel,IF(ISBLANK(Data2!$C28),NA(),Data2!$C28),IF(ISBLANK(Data2!$D28),NA(),Data2!$D28))","v":{"$error":"#N/A"}},{"$f":"IF(Data2!testType=\"COMP+REB\", IF(ISBLANK(Data2!D28), NA(), Data2!D28), NA())","v":{"$error":"#N/A"}},{"$f":"CHOOSE(DistSel,IF(ISBLANK(Data3!$A28),NA(),Data3!$A28),IF(ISBLANK(Data3!$B28),NA(),Data3!$B28))","v":{"$error":"#N/A"}},{"$f":"CHOOSE(LoadSel,IF(ISBLANK(Data3!$C28),NA(),Data3!$C28),IF(ISBLANK(Data3!$D28),NA(),Data3!$D28))","v":{"$error":"#N/A"}},{"$f":"IF(Data3!testType=\"COMP+REB\", IF(ISBLANK(Data3!D28), NA(), Data3!D28), NA())","v":{"$error":"#N/A"}},{"$f":"CHOOSE(DistSel,IF(ISBLANK(Data4!$A28),NA(),Data4!$A28),IF(ISBLANK(Data4!$B28),NA(),Data4!$B28))","v":{"$error":"#N/A"}},{"$f":"CHOOSE(LoadSel,IF(ISBLANK(Data4!$C28),NA(),Data4!$C28),IF(ISBLANK(Data4!$D28),NA(),Data4!$D28))","v":{"$error":"#N/A"}},{"$f":"IF(Data4!testType=\"COMP+REB\", IF(ISBLANK(Data4!D28), NA(), Data4!D28), NA())","v":{"$error":"#N/A"}}]
[{"$f":"CHOOSE(DistSel,IF(ISBLANK(Data1!$A29),NA(),Data1!$A29),IF(ISBLANK(Data1!$B29),NA(),Data1!$B29))","v":{"$error":"#N/A"}},{"$f":"CHOOSE(LoadSel,IF(ISBLANK(Data1!$C29),NA(),Data1!$C29),IF(ISBLANK(Data1!$D29),NA(),Data1!$D29))","v":{"$error":"#N/A"}},{"$f":"IF(Data1!testType=\"COMP+REB\", IF(ISBLANK(Data1!D29), NA(), Data1!D29), NA())","v":{"$error":"#N/A"}},{"$f":"CHOOSE(DistSel,IF(ISBLANK(Data2!$A29),NA(),Data2!$A29),IF(ISBLANK(Data2!$B29),NA(),Data2!$B29))","v":{"$error":"#N/A"}},{"$f":"CHOOSE(LoadSel,IF(ISBLANK(Data2!$C29),NA(),Data2!$C29),IF(ISBLANK(Data2!$D29),NA(),Data2!$D29))","v":{"$error":"#N/A"}},{"$f":"IF(Data2!testType=\"COMP+REB\", IF(ISBLANK(Data2!D29), NA(), Data2!D29), NA())","v":{"$error":"#N/A"}},{"$f":"CHOOSE(DistSel,IF(ISBLANK(Data3!$A29),NA(),Data3!$A29),IF(ISBLANK(Data3!$B29),NA(),Data3!$B29))","v":{"$error":"#N/A"}},{"$f":"CHOOSE(LoadSel,IF(ISBLANK(Data3!$C29),NA(),Data3!$C29),IF(ISBLANK(Data3!$D29),NA(),Data3!$D29))","v":{"$error":"#N/A"}},{"$f":"IF(Data3!testType=\"COMP+REB\", IF(ISBLANK(Data3!D29), NA(), Data3!D29), NA())","v":{"$error":"#N/A"}},{"$f":"CHOOSE(DistSel,IF(ISBLANK(Data4!$A29),NA(),Data4!$A29),IF(ISBLANK(Data4!$B29),NA(),Data4!$B29))","v":{"$error":"#N/A"}},{"$f":"CHOOSE(LoadSel,IF(ISBLANK(Data4!$C29),NA(),Data4!$C29),IF(ISBLANK(Data4!$D29),NA(),Data4!$D29))","v":{"$error":"#N/A"}},{"$f":"IF(Data4!testType=\"COMP+REB\", IF(ISBLANK(Data4!D29), NA(), Data4!D29), NA())","v":{"$error":"#N/A"}}]
[{"$f":"CHOOSE(DistSel,IF(ISBLANK(Data1!$A30),NA(),Data1!$A30),IF(ISBLANK(Data1!$B30),NA(),Data1!$B30))","v":{"$error":"#N/A"}},{"$f":"CHOOSE(LoadSel,IF(ISBLANK(Data1!$C30),NA(),Data1!$C30),IF(ISBLANK(Data1!$D30),NA(),Data1!$D30))","v":{"$error":"#N/A"}},{"$f":"IF(Data1!testType=\"COMP+REB\", IF(ISBLANK(Data1!D30), NA(), Data1!D30), NA())","v":{"$error":"#N/A"}},{"$f":"CHOOSE(DistSel,IF(ISBLANK(Data2!$A30),NA(),Data2!$A30),IF(ISBLANK(Data2!$B30),NA(),Data2!$B30))","v":{"$error":"#N/A"}},{"$f":"CHOOSE(LoadSel,IF(ISBLANK(Data2!$C30),NA(),Data2!$C30),IF(ISBLANK(Data2!$D30),NA(),Data2!$D30))","v":{"$error":"#N/A"}},{"$f":"IF(Data2!testType=\"COMP+REB\", IF(ISBLANK(Data2!D30), NA(), Data2!D30), NA())","v":{"$error":"#N/A"}},{"$f":"CHOOSE(DistSel,IF(ISBLANK(Data3!$A30),NA(),Data3!$A30),IF(ISBLANK(Data3!$B30),NA(),Data3!$B30))","v":{"$error":"#N/A"}},{"$f":"CHOOSE(LoadSel,IF(ISBLANK(Data3!$C30),NA(),Data3!$C30),IF(ISBLANK(Data3!$D30),NA(),Data3!$D30))","v":{"$error":"#N/A"}},{"$f":"IF(Data3!testType=\"COMP+REB\", IF(ISBLANK(Data3!D30), NA(), Data3!D30), NA())","v":{"$error":"#N/A"}},{"$f":"CHOOSE(DistSel,IF(ISBLANK(Data4!$A30),NA(),Data4!$A30),IF(ISBLANK(Data4!$B30),NA(),Data4!$B30))","v":{"$error":"#N/A"}},{"$f":"CHOOSE(LoadSel,IF(ISBLANK(Data4!$C30),NA(),Data4!$C30),IF(ISBLANK(Data4!$D30),NA(),Data4!$D30))","v":{"$error":"#N/A"}},{"$f":"IF(Data4!testType=\"COMP+REB\", IF(ISBLANK(Data4!D30), NA(), Data4!D30), NA())","v":{"$error":"#N/A"}}]
[{"$f":"CHOOSE(DistSel,IF(ISBLANK(Data1!$A31),NA(),Data1!$A31),IF(ISBLANK(Data1!$B31),NA(),Data1!$B31))","v":{"$error":"#N/A"}},{"$f":"CHOOSE(LoadSel,IF(ISBLANK(Data1!$C31),NA(),Data1!$C31),IF(ISBLANK(Data1!$D31),NA(),Data1!$D31))","v":{"$error":"#N/A"}},{"$f":"IF(Data1!testType=\"COMP+REB\", IF(ISBLANK(Data1!D31), NA(), Data1!D31), NA())","v":{"$error":"#N/A"}},{"$f":"CHOOSE(DistSel,IF(ISBLANK(Data2!$A31),NA(),Data2!$A31),IF(ISBLANK(Data2!$B31),NA(),Data2!$B31))","v":{"$error":"#N/A"}},{"$f":"CHOOSE(LoadSel,IF(ISBLANK(Data2!$C31),NA(),Data2!$C31),IF(ISBLANK(Data2!$D31),NA(),Data2!$D31))","v":{"$error":"#N/A"}},{"$f":"IF(Data2!testType=\"COMP+REB\", IF(ISBLANK(Data2!D31), NA(), Data2!D31), NA())","v":{"$error":"#N/A"}},{"$f":"CHOOSE(DistSel,IF(ISBLANK(Data3!$A31),NA(),Data3!$A31),IF(ISBLANK(Data3!$B31),NA(),Data3!$B31))","v":{"$error":"#N/A"}},{"$f":"CHOOSE(LoadSel,IF(ISBLANK(Data3!$C31),NA(),Data3!$C31),IF(ISBLANK(Data3!$D31),NA(),Data3!$D31))","v":{"$error":"#N/A"}},{"$f":"IF(Data3!testType=\"COMP+REB\", IF(ISBLANK(Data3!D31), NA(), Data3!D31), NA())","v":{"$error":"#N/A"}},{"$f":"CHOOSE(DistSel,IF(ISBLANK(Data4!$A31),NA(),Data4!$A31),IF(ISBLANK(Data4!$B31),NA(),Data4!$B31))","v":{"$error":"#N/A"}},{"$f":"CHOOSE(LoadSel,IF(ISBLANK(Data4!$C31),NA(),Data4!$C31),IF(ISBLANK(Data4!$D31),NA(),Data4!$D31))","v":{"$error":"#N/A"}},{"$f":"IF(Data4!testType=\"COMP+REB\", IF(ISBLANK(Data4!D31), NA(), Data4!D31), NA())","v":{"$error":"#N/A"}}]
[{"$f":"CHOOSE(DistSel,IF(ISBLANK(Data1!$A32),NA(),Data1!$A32),IF(ISBLANK(Data1!$B32),NA(),Data1!$B32))","v":{"$error":"#N/A"}},{"$f":"CHOOSE(LoadSel,IF(ISBLANK(Data1!$C32),NA(),Data1!$C32),IF(ISBLANK(Data1!$D32),NA(),Data1!$D32))","v":{"$error":"#N/A"}},{"$f":"IF(Data1!testType=\"COMP+REB\", IF(ISBLANK(Data1!D32), NA(), Data1!D32), NA())","v":{"$error":"#N/A"}},{"$f":"CHOOSE(DistSel,IF(ISBLANK(Data2!$A32),NA(),Data2!$A32),IF(ISBLANK(Data2!$B32),NA(),Data2!$B32))","v":{"$error":"#N/A"}},{"$f":"CHOOSE(LoadSel,IF(ISBLANK(Data2!$C32),NA(),Data2!$C32),IF(ISBLANK(Data2!$D32),NA(),Data2!$D32))","v":{"$error":"#N/A"}},{"$f":"IF(Data2!testType=\"COMP+REB\", IF(ISBLANK(Data2!D32), NA(), Data2!D32), NA())","v":{"$error":"#N/A"}},{"$f":"CHOOSE(DistSel,IF(ISBLANK(Data3!$A32),NA(),Data3!$A32),IF(ISBLANK(Data3!$B32),NA(),Data3!$B32))","v":{"$error":"#N/A"}},{"$f":"CHOOSE(LoadSel,IF(ISBLANK(Data3!$C32),NA(),Data3!$C32),IF(ISBLANK(Data3!$D32),NA(),Data3!$D32))","v":{"$error":"#N/A"}},{"$f":"IF(Data3!testType=\"COMP+REB\", IF(ISBLANK(Data3!D32), NA(), Data3!D32), NA())","v":{"$error":"#N/A"}},{"$f":"CHOOSE(DistSel,IF(ISBLANK(Data4!$A32),NA(),Data4!$A32),IF(ISBLANK(Data4!$B32),NA(),Data4!$B32))","v":{"$error":"#N/A"}},{"$f":"CHOOSE(LoadSel,IF(ISBLANK(Data4!$C32),NA(),Data4!$C32),IF(ISBLANK(Data4!$D32),NA(),Data4!$D32))","v":{"$error":"#N/A"}},{"$f":"IF(Data4!testType=\"COMP+REB\", IF(ISBLANK(Data4!D32), NA(), Data4!D32), NA())","v":{"$error":"#N/A"}}]
[{"$f":"CHOOSE(DistSel,IF(ISBLANK(Data1!$A33),NA(),Data1!$A33),IF(ISBLANK(Data1!$B33),NA(),Data1!$B33))","v":{"$error":"#N/A"}},{"$f":"CHOOSE(LoadSel,IF(ISBLANK(Data1!$C33),NA(),Data1!$C33),IF(ISBLANK(Data1!$D33),NA(),Data1!$D33))","v":{"$error":"#N/A"}},{"$f":"IF(Data1!testType=\"COMP+REB\", IF(ISBLANK(Data1!D33), NA(), Data1!D33), NA())","v":{"$error":"#N/A"}},{"$f":"CHOOSE(DistSel,IF(ISBLANK(Data2!$A33),NA(),Data2!$A33),IF(ISBLANK(Data2!$B33),NA(),Data2!$B33))","v":{"$error":"#N/A"}},{"$f":"CHOOSE(LoadSel,IF(ISBLANK(Data2!$C33),NA(),Data2!$C33),IF(ISBLANK(Data2!$D33),NA(),Data2!$D33))","v":{"$error":"#N/A"}},{"$f":"IF(Data2!testType=\"COMP+REB\", IF(ISBLANK(Data2!D33), NA(), Data2!D33), NA())","v":{"$error":"#N/A"}},{"$f":"CHOOSE(DistSel,IF(ISBLANK(Data3!$A33),NA(),Data3!$A33),IF(ISBLANK(Data3!$B33),NA(),Data3!$B33))","v":{"$error":"#N/A"}},{"$f":"CHOOSE(LoadSel,IF(ISBLANK(Data3!$C33),NA(),Data3!$C33),IF(ISBLANK(Data3!$D33),NA(),Data3!$D33))","v":{"$error":"#N/A"}},{"$f":"IF(Data3!testType=\"COMP+REB\", IF(ISBLANK(Data3!D33), NA(), Data3!D33), NA())","v":{"$error":"#N/A"}},{"$f":"CHOOSE(DistSel,IF(ISBLANK(Data4!$A33),NA(),Data4!$A33),IF(ISBLANK(Data4!$B33),NA(),Data4!$B33))","v":{"$error":"#N/A"}},{"$f":"CHOOSE(LoadSel,IF(ISBLANK(Data4!$C33),NA(),Data4!$C33),IF(ISBLANK(Data4!$D33),NA(),Data4!$D33))","v":{"$error":"#N/A"}},{"$f":"IF(Data4!testType=\"COMP+REB\", IF(ISBLANK(Data4!D33), NA(), Data4!D33), NA())","v":{"$error":"#N/A"}}]
[{"$f":"CHOOSE(DistSel,IF(ISBLANK(Data1!$A34),NA(),Data1!$A34),IF(ISBLANK(Data1!$B34),NA(),Data1!$B34))","v":{"$error":"#N/A"}},{"$f":"CHOOSE(LoadSel,IF(ISBLANK(Data1!$C34),NA(),Data1!$C34),IF(ISBLANK(Data1!$D34),NA(),Data1!$D34))","v":{"$error":"#N/A"}},{"$f":"IF(Data1!testType=\"COMP+REB\", IF(ISBLANK(Data1!D34), NA(), Data1!D34), NA())","v":{"$error":"#N/A"}},{"$f":"CHOOSE(DistSel,IF(ISBLANK(Data2!$A34),NA(),Data2!$A34),IF(ISBLANK(Data2!$B34),NA(),Data2!$B34))","v":{"$error":"#N/A"}},{"$f":"CHOOSE(LoadSel,IF(ISBLANK(Data2!$C34),NA(),Data2!$C34),IF(ISBLANK(Data2!$D34),NA(),Data2!$D34))","v":{"$error":"#N/A"}},{"$f":"IF(Data2!testType=\"COMP+REB\", IF(ISBLANK(Data2!D34), NA(), Data2!D34), NA())","v":{"$error":"#N/A"}},{"$f":"CHOOSE(DistSel,IF(ISBLANK(Data3!$A34),NA(),Data3!$A34),IF(ISBLANK(Data3!$B34),NA(),Data3!$B34))","v":{"$error":"#N/A"}},{"$f":"CHOOSE(LoadSel,IF(ISBLANK(Data3!$C34),NA(),Data3!$C34),IF(ISBLANK(Data3!$D34),NA(),Data3!$D34))","v":{"$error":"#N/A"}},{"$f":"IF(Data3!testType=\"COMP+REB\", IF(ISBLANK(Data3!D34), NA(), Data3!D34), NA())","v":{"$error":"#N/A"}},{"$f":"CHOOSE(DistSel,IF(ISBLANK(Data4!$A34),NA(),Data4!$A34),IF(ISBLANK(Data4!$B34),NA(),Data4!$B34))","v":{"$error":"#N/A"}},{"$f":"CHOOSE(LoadSel,IF(ISBLANK(Data4!$C34),NA(),Data4!$C34),IF(ISBLANK(Data4!$D34),NA(),Data4!$D34))","v":{"$error":"#N/A"}},{"$f":"IF(Data4!testType=\"COMP+REB\", IF(ISBLANK(Data4!D34), NA(), Data4!D34), NA())","v":{"$error":"#N/A"}}]
[{"$f":"CHOOSE(DistSel,IF(ISBLANK(Data1!$A35),NA(),Data1!$A35),IF(ISBLANK(Data1!$B35),NA(),Data1!$B35))","v":{"$error":"#N/A"}},{"$f":"CHOOSE(LoadSel,IF(ISBLANK(Data1!$C35),NA(),Data1!$C35),IF(ISBLANK(Data1!$D35),NA(),Data1!$D35))","v":{"$error":"#N/A"}},{"$f":"IF(Data1!testType=\"COMP+REB\", IF(ISBLANK(Data1!D35), NA(), Data1!D35), NA())","v":{"$error":"#N/A"}},{"$f":"CHOOSE(DistSel,IF(ISBLANK(Data2!$A35),NA(),Data2!$A35),IF(ISBLANK(Data2!$B35),NA(),Data2!$B35))","v":{"$error":"#N/A"}},{"$f":"CHOOSE(LoadSel,IF(ISBLANK(Data2!$C35),NA(),Data2!$C35),IF(ISBLANK(Data2!$D35),NA(),Data2!$D35))","v":{"$error":"#N/A"}},{"$f":"IF(Data2!testType=\"COMP+REB\", IF(ISBLANK(Data2!D35), NA(), Data2!D35), NA())","v":{"$error":"#N/A"}},{"$f":"CHOOSE(DistSel,IF(ISBLANK(Data3!$A35),NA(),Data3!$A35),IF(ISBLANK(Data3!$B35),NA(),Data3!$B35))","v":{"$error":"#N/A"}},{"$f":"CHOOSE(LoadSel,IF(ISBLANK(Data3!$C35),NA(),Data3!$C35),IF(ISBLANK(Data3!$D35),NA(),Data3!$D35))","v":{"$error":"#N/A"}},{"$f":"IF(Data3!testType=\"COMP+REB\", IF(ISBLANK(Data3!D35), NA(), Data3!D35), NA())","v":{"$error":"#N/A"}},{"$f":"CHOOSE(DistSel,IF(ISBLANK(Data4!$A35),NA(),Data4!$A35),IF(ISBLANK(Data4!$B35),NA(),Data4!$B35))","v":{"$error":"#N/A"}},{"$f":"CHOOSE(LoadSel,IF(ISBLANK(Data4!$C35),NA(),Data4!$C35),IF(ISBLANK(Data4!$D35),NA(),Data4!$D35))","v":{"$error":"#N/A"}},{"$f":"IF(Data4!testType=\"COMP+REB\", IF(ISBLANK(Data4!D35), NA(), Data4!D35), NA())","v":{"$error":"#N/A"}}]
[{"$f":"CHOOSE(DistSel,IF(ISBLANK(Data1!$A36),NA(),Data1!$A36),IF(ISBLANK(Data1!$B36),NA(),Data1!$B36))","v":{"$error":"#N/A"}},{"$f":"CHOOSE(LoadSel,IF(ISBLANK(Data1!$C36),NA(),Data1!$C36),IF(ISBLANK(Data1!$D36),NA(),Data1!$D36))","v":{"$error":"#N/A"}},{"$f":"IF(Data1!testType=\"COMP+REB\", IF(ISBLANK(Data1!D36), NA(), Data1!D36), NA())","v":{"$error":"#N/A"}},{"$f":"CHOOSE(DistSel,IF(ISBLANK(Data2!$A36),NA(),Data2!$A36),IF(ISBLANK(Data2!$B36),NA(),Data2!$B36))","v":{"$error":"#N/A"}},{"$f":"CHOOSE(LoadSel,IF(ISBLANK(Data2!$C36),NA(),Data2!$C36),IF(ISBLANK(Data2!$D36),NA(),Data2!$D36))","v":{"$error":"#N/A"}},{"$f":"IF(Data2!testType=\"COMP+REB\", IF(ISBLANK(Data2!D36), NA(), Data2!D36), NA())","v":{"$error":"#N/A"}},{"$f":"CHOOSE(DistSel,IF(ISBLANK(Data3!$A36),NA(),Data3!$A36),IF(ISBLANK(Data3!$B36),NA(),Data3!$B36))","v":{"$error":"#N/A"}},{"$f":"CHOOSE(LoadSel,IF(ISBLANK(Data3!$C36),NA(),Data3!$C36),IF(ISBLANK(Data3!$D36),NA(),Data3!$D36))","v":{"$error":"#N/A"}},{"$f":"IF(Data3!testType=\"COMP+REB\", IF(ISBLANK(Data3!D36), NA(), Data3!D36), NA())","v":{"$error":"#N/A"}},{"$f":"CHOOSE(DistSel,IF(ISBLANK(Data4!$A36),NA(),Data4!$A36),IF(ISBLANK(Data4!$B36),NA(),Data4!$B36))","v":{"$error":"#N/A"}},{"$f":"CHOOSE(LoadSel,IF(ISBLANK(Data4!$C36),NA(),Data4!$C36),IF(ISBLANK(Data4!$D36),NA(),Data4!$D36))","v":{"$error":"#N/A"}},{"$f":"IF(Data4!testType=\"COMP+REB\", IF(ISBLANK(Data4!D36), NA(), Data4!D36), NA())","v":{"$error":"#N/A"}}]
[{"$f":"CHOOSE(DistSel,IF(ISBLANK(Data1!$A37),NA(),Data1!$A37),IF(ISBLANK(Data1!$B37),NA(),Data1!$B37))","v":{"$error":"#N/A"}},{"$f":"CHOOSE(LoadSel,IF(ISBLANK(Data1!$C37),NA(),Data1!$C37),IF(ISBLANK(Data1!$D37),NA(),Data1!$D37))","v":{"$error":"#N/A"}},{"$f":"IF(Data1!testType=\"COMP+REB\", IF(ISBLANK(Data1!D37), NA(), Data1!D37), NA())","v":{"$error":"#N/A"}},{"$f":"CHOOSE(DistSel,IF(ISBLANK(Data2!$A37),NA(),Data2!$A37),IF(ISBLANK(Data2!$B37),NA(),Data2!$B37))","v":{"$error":"#N/A"}},{"$f":"CHOOSE(LoadSel,IF(ISBLANK(Data2!$C37),NA(),Data2!$C37),IF(ISBLANK(Data2!$D37),NA(),Data2!$D37))","v":{"$error":"#N/A"}},{"$f":"IF(Data2!testType=\"COMP+REB\", IF(ISBLANK(Data2!D37), NA(), Data2!D37), NA())","v":{"$error":"#N/A"}},{"$f":"CHOOSE(DistSel,IF(ISBLANK(Data3!$A37),NA(),Data3!$A37),IF(ISBLANK(Data3!$B37),NA(),Data3!$B37))","v":{"$error":"#N/A"}},{"$f":"CHOOSE(LoadSel,IF(ISBLANK(Data3!$C37),NA(),Data3!$C37),IF(ISBLANK(Data3!$D37),NA(),Data3!$D37))","v":{"$error":"#N/A"}},{"$f":"IF(Data3!testType=\"COMP+REB\", IF(ISBLANK(Data3!D37), NA(), Data3!D37), NA())","v":{"$error":"#N/A"}},{"$f":"CHOOSE(DistSel,IF(ISBLANK(Data4!$A37),NA(),Data4!$A37),IF(ISBLANK(Data4!$B37),NA(),Data4!$B37))","v":{"$error":"#N/A"}},{"$f":"CHOOSE(LoadSel,IF(ISBLANK(Data4!$C37),NA(),Data4!$C37),IF(ISBLANK(Data4!$D37),NA(),Data4!$D37))","v":{"$error":"#N/A"}},{"$f":"IF(Data4!testType=\"COMP+REB\", IF(ISBLANK(Data4!D37), NA(), Data4!D37), NA())","v":{"$error":"#N/A"}}]
[{"$f":"CHOOSE(DistSel,IF(ISBLANK(Data1!$A38),NA(),Data1!$A38),IF(ISBLANK(Data1!$B38),NA(),Data1!$B38))","v":{"$error":"#N/A"}},{"$f":"CHOOSE(LoadSel,IF(ISBLANK(Data1!$C38),NA(),Data1!$C38),IF(ISBLANK(Data1!$D38),NA(),Data1!$D38))","v":{"$error":"#N/A"}},{"$f":"IF(Data1!testType=\"COMP+REB\", IF(ISBLANK(Data1!D38), NA(), Data1!D38), NA())","v":{"$error":"#N/A"}},{"$f":"CHOOSE(DistSel,IF(ISBLANK(Data2!$A38),NA(),Data2!$A38),IF(ISBLANK(Data2!$B38),NA(),Data2!$B38))","v":{"$error":"#N/A"}},{"$f":"CHOOSE(LoadSel,IF(ISBLANK(Data2!$C38),NA(),Data2!$C38),IF(ISBLANK(Data2!$D38),NA(),Data2!$D38))","v":{"$error":"#N/A"}},{"$f":"IF(Data2!testType=\"COMP+REB\", IF(ISBLANK(Data2!D38), NA(), Data2!D38), NA())","v":{"$error":"#N/A"}},{"$f":"CHOOSE(DistSel,IF(ISBLANK(Data3!$A38),NA(),Data3!$A38),IF(ISBLANK(Data3!$B38),NA(),Data3!$B38))","v":{"$error":"#N/A"}},{"$f":"CHOOSE(LoadSel,IF(ISBLANK(Data3!$C38),NA(),Data3!$C38),IF(ISBLANK(Data3!$D38),NA(),Data3!$D38))","v":{"$error":"#N/A"}},{"$f":"IF(Data3!testType=\"COMP+REB\", IF(ISBLANK(Data3!D38), NA(), Data3!D38), NA())","v":{"$error":"#N/A"}},{"$f":"CHOOSE(DistSel,IF(ISBLANK(Data4!$A38),NA(),Data4!$A38),IF(ISBLANK(Data4!$B38),NA(),Data4!$B38))","v":{"$error":"#N/A"}},{"$f":"CHOOSE(LoadSel,IF(ISBLANK(Data4!$C38),NA(),Data4!$C38),IF(ISBLANK(Data4!$D38),NA(),Data4!$D38))","v":{"$error":"#N/A"}},{"$f":"IF(Data4!testType=\"COMP+REB\", IF(ISBLANK(Data4!D38), NA(), Data4!D38), NA())","v":{"$error":"#N/A"}}]
[{"$f":"CHOOSE(DistSel,IF(ISBLANK(Data1!$A39),NA(),Data1!$A39),IF(ISBLANK(Data1!$B39),NA(),Data1!$B39))","v":{"$error":"#N/A"}},{"$f":"CHOOSE(LoadSel,IF(ISBLANK(Data1!$C39),NA(),Data1!$C39),IF(ISBLANK(Data1!$D39),NA(),Data1!$D39))","v":{"$error":"#N/A"}},{"$f":"IF(Data1!testType=\"COMP+REB\", IF(ISBLANK(Data1!D39), NA(), Data1!D39), NA())","v":{"$error":"#N/A"}},{"$f":"CHOOSE(DistSel,IF(ISBLANK(Data2!$A39),NA(),Data2!$A39),IF(ISBLANK(Data2!$B39),NA(),Data2!$B39))","v":{"$error":"#N/A"}},{"$f":"CHOOSE(LoadSel,IF(ISBLANK(Data2!$C39),NA(),Data2!$C39),IF(ISBLANK(Data2!$D39),NA(),Data2!$D39))","v":{"$error":"#N/A"}},{"$f":"IF(Data2!testType=\"COMP+REB\", IF(ISBLANK(Data2!D39), NA(), Data2!D39), NA())","v":{"$error":"#N/A"}},{"$f":"CHOOSE(DistSel,IF(ISBLANK(Data3!$A39),NA(),Data3!$A39),IF(ISBLANK(Data3!$B39),NA(),Data3!$B39))","v":{"$error":"#N/A"}},{"$f":"CHOOSE(LoadSel,IF(ISBLANK(Data3!$C39),NA(),Data3!$C39),IF(ISBLANK(Data3!$D39),NA(),Data3!$D39))","v":{"$error":"#N/A"}},{"$f":"IF(Data3!testType=\"COMP+REB\", IF(ISBLANK(Data3!D39), NA(), Data3!D39), NA())","v":{"$error":"#N/A"}},{"$f":"CHOOSE(DistSel,IF(ISBLANK(Data4!$A39),NA(),Data4!$A39),IF(ISBLANK(Data4!$B39),NA(),Data4!$B39))","v":{"$error":"#N/A"}},{"$f":"CHOOSE(LoadSel,IF(ISBLANK(Data4!$C39),NA(),Data4!$C39),IF(ISBLANK(Data4!$D39),NA(),Data4!$D39))","v":{"$error":"#N/A"}},{"$f":"IF(Data4!testType=\"COMP+REB\", IF(ISBLANK(Data4!D39), NA(), Data4!D39), NA())","v":{"$error":"#N/A"}}]
[{"$f":"CHOOSE(DistSel,IF(ISBLANK(Data1!$A40),NA(),Data1!$A40),IF(ISBLANK(Data1!$B40),NA(),Data1!$B40))","v":{"$error":"#N/A"}},{"$f":"CHOOSE(LoadSel,IF(ISBLANK(Data1!$C40),NA(),Data1!$C40),IF(ISBLANK(Data1!$D40),NA(),Data1!$D40))","v":{"$error":"#N/A"}},{"$f":"IF(Data1!testType=\"COMP+REB\", IF(ISBLANK(Data1!D40), NA(), Data1!D40), NA())","v":{"$error":"#N/A"}},{"$f":"CHOOSE(DistSel,IF(ISBLANK(Data2!$A40),NA(),Data2!$A40),IF(ISBLANK(Data2!$B40),NA(),Data2!$B40))","v":{"$error":"#N/A"}},{"$f":"CHOOSE(LoadSel,IF(ISBLANK(Data2!$C40),NA(),Data2!$C40),IF(ISBLANK(Data2!$D40),NA(),Data2!$D40))","v":{"$error":"#N/A"}},{"$f":"IF(Data2!testType=\"COMP+REB\", IF(ISBLANK(Data2!D40), NA(), Data2!D40), NA())","v":{"$error":"#N/A"}},{"$f":"CHOOSE(DistSel,IF(ISBLANK(Data3!$A40),NA(),Data3!$A40),IF(ISBLANK(Data3!$B40),NA(),Data3!$B40))","v":{"$error":"#N/A"}},{"$f":"CHOOSE(LoadSel,IF(ISBLANK(Data3!$C40),NA(),Data3!$C40),IF(ISBLANK(Data3!$D40),NA(),Data3!$D40))","v":{"$error":"#N/A"}},{"$f":"IF(Data3!testType=\"COMP+REB\", IF(ISBLANK(Data3!D40), NA(), Data3!D40), NA())","v":{"$error":"#N/A"}},{"$f":"CHOOSE(DistSel,IF(ISBLANK(Data4!$A40),NA(),Data4!$A40),IF(ISBLANK(Data4!$B40),NA(),Data4!$B40))","v":{"$error":"#N/A"}},{"$f":"CHOOSE(LoadSel,IF(ISBLANK(Data4!$C40),NA(),Data4!$C40),IF(ISBLANK(Data4!$D40),NA(),Data4!$D40))","v":{"$error":"#N/A"}},{"$f":"IF(Data4!testType=\"COMP+REB\", IF(ISBLANK(Data4!D40), NA(), Data4!D40), NA())","v":{"$error":"#N/A"}}]
[{"$f":"CHOOSE(DistSel,IF(ISBLANK(Data1!$A41),NA(),Data1!$A41),IF(ISBLANK(Data1!$B41),NA(),Data1!$B41))","v":{"$error":"#N/A"}},{"$f":"CHOOSE(LoadSel,IF(ISBLANK(Data1!$C41),NA(),Data1!$C41),IF(ISBLANK(Data1!$D41),NA(),Data1!$D41))","v":{"$error":"#N/A"}},{"$f":"IF(Data1!testType=\"COMP+REB\", IF(ISBLANK(Data1!D41), NA(), Data1!D41), NA())","v":{"$error":"#N/A"}},{"$f":"CHOOSE(DistSel,IF(ISBLANK(Data2!$A41),NA(),Data2!$A41),IF(ISBLANK(Data2!$B41),NA(),Data2!$B41))","v":{"$error":"#N/A"}},{"$f":"CHOOSE(LoadSel,IF(ISBLANK(Data2!$C41),NA(),Data2!$C41),IF(ISBLANK(Data2!$D41),NA(),Data2!$D41))","v":{"$error":"#N/A"}},{"$f":"IF(Data2!testType=\"COMP+REB\", IF(ISBLANK(Data2!D41), NA(), Data2!D41), NA())","v":{"$error":"#N/A"}},{"$f":"CHOOSE(DistSel,IF(ISBLANK(Data3!$A41),NA(),Data3!$A41),IF(ISBLANK(Data3!$B41),NA(),Data3!$B41))","v":{"$error":"#N/A"}},{"$f":"CHOOSE(LoadSel,IF(ISBLANK(Data3!$C41),NA(),Data3!$C41),IF(ISBLANK(Data3!$D41),NA(),Data3!$D41))","v":{"$error":"#N/A"}},{"$f":"IF(Data3!testType=\"COMP+REB\", IF(ISBLANK(Data3!D41), NA(), Data3!D41), NA())","v":{"$error":"#N/A"}},{"$f":"CHOOSE(DistSel,IF(ISBLANK(Data4!$A41),NA(),Data4!$A41),IF(ISBLANK(Data4!$B41),NA(),Data4!$B41))","v":{"$error":"#N/A"}},{"$f":"CHOOSE(LoadSel,IF(ISBLANK(Data4!$C41),NA(),Data4!$C41),IF(ISBLANK(Data4!$D41),NA(),Data4!$D41))","v":{"$error":"#N/A"}},{"$f":"IF(Data4!testType=\"COMP+REB\", IF(ISBLANK(Data4!D41), NA(), Data4!D41), NA())","v":{"$error":"#N/A"}}]
[{"$f":"CHOOSE(DistSel,IF(ISBLANK(Data1!$A42),NA(),Data1!$A42),IF(ISBLANK(Data1!$B42),NA(),Data1!$B42))","v":{"$error":"#N/A"}},{"$f":"CHOOSE(LoadSel,IF(ISBLANK(Data1!$C42),NA(),Data1!$C42),IF(ISBLANK(Data1!$D42),NA(),Data1!$D42))","v":{"$error":"#N/A"}},{"$f":"IF(Data1!testType=\"COMP+REB\", IF(ISBLANK(Data1!D42), NA(), Data1!D42), NA())","v":{"$error":"#N/A"}},{"$f":"CHOOSE(DistSel,IF(ISBLANK(Data2!$A42),NA(),Data2!$A42),IF(ISBLANK(Data2!$B42),NA(),Data2!$B42))","v":{"$error":"#N/A"}},{"$f":"CHOOSE(LoadSel,IF(ISBLANK(Data2!$C42),NA(),Data2!$C42),IF(ISBLANK(Data2!$D42),NA(),Data2!$D42))","v":{"$error":"#N/A"}},{"$f":"IF(Data2!testType=\"COMP+REB\", IF(ISBLANK(Data2!D42), NA(), Data2!D42), NA())","v":{"$error":"#N/A"}},{"$f":"CHOOSE(DistSel,IF(ISBLANK(Data3!$A42),NA(),Data3!$A42),IF(ISBLANK(Data3!$B42),NA(),Data3!$B42))","v":{"$error":"#N/A"}},{"$f":"CHOOSE(LoadSel,IF(ISBLANK(Data3!$C42),NA(),Data3!$C42),IF(ISBLANK(Data3!$D42),NA(),Data3!$D42))","v":{"$error":"#N/A"}},{"$f":"IF(Data3!testType=\"COMP+REB\", IF(ISBLANK(Data3!D42), NA(), Data3!D42), NA())","v":{"$error":"#N/A"}},{"$f":"CHOOSE(DistSel,IF(ISBLANK(Data4!$A42),NA(),Data4!$A42),IF(ISBLANK(Data4!$B42),NA(),Data4!$B42))","v":{"$error":"#N/A"}},{"$f":"CHOOSE(LoadSel,IF(ISBLANK(Data4!$C42),NA(),Data4!$C42),IF(ISBLANK(Data4!$D42),NA(),Data4!$D42))","v":{"$error":"#N/A"}},{"$f":"IF(Data4!testType=\"COMP+REB\", IF(ISBLANK(Data4!D42), NA(), Data4!D42), NA())","v":{"$error":"#N/A"}}]
[{"$f":"CHOOSE(DistSel,IF(ISBLANK(Data1!$A43),NA(),Data1!$A43),IF(ISBLANK(Data1!$B43),NA(),Data1!$B43))","v":{"$error":"#N/A"}},{"$f":"CHOOSE(LoadSel,IF(ISBLANK(Data1!$C43),NA(),Data1!$C43),IF(ISBLANK(Data1!$D43),NA(),Data1!$D43))","v":{"$error":"#N/A"}},{"$f":"IF(Data1!testType=\"COMP+REB\", IF(ISBLANK(Data1!D43), NA(), Data1!D43), NA())","v":{"$error":"#N/A"}},{"$f":"CHOOSE(DistSel,IF(ISBLANK(Data2!$A43),NA(),Data2!$A43),IF(ISBLANK(Data2!$B43),NA(),Data2!$B43))","v":{"$error":"#N/A"}},{"$f":"CHOOSE(LoadSel,IF(ISBLANK(Data2!$C43),NA(),Data2!$C43),IF(ISBLANK(Data2!$D43),NA(),Data2!$D43))","v":{"$error":"#N/A"}},{"$f":"IF(Data2!testType=\"COMP+REB\", IF(ISBLANK(Data2!D43), NA(), Data2!D43), NA())","v":{"$error":"#N/A"}},{"$f":"CHOOSE(DistSel,IF(ISBLANK(Data3!$A43),NA(),Data3!$A43),IF(ISBLANK(Data3!$B43),NA(),Data3!$B43))","v":{"$error":"#N/A"}},{"$f":"CHOOSE(LoadSel,IF(ISBLANK(Data3!$C43),NA(),Data3!$C43),IF(ISBLANK(Data3!$D43),NA(),Data3!$D43))","v":{"$error":"#N/A"}},{"$f":"IF(Data3!testType=\"COMP+REB\", IF(ISBLANK(Data3!D43), NA(), Data3!D43), NA())","v":{"$error":"#N/A"}},{"$f":"CHOOSE(DistSel,IF(ISBLANK(Data4!$A43),NA(),Data4!$A43),IF(ISBLANK(Data4!$B43),NA(),Data4!$B43))","v":{"$error":"#N/A"}},{"$f":"CHOOSE(LoadSel,IF(ISBLANK(Data4!$C43),NA(),Data4!$C43),IF(ISBLANK(Data4!$D43),NA(),Data4!$D43))","v":{"$error":"#N/A"}},{"$f":"IF(Data4!testType=\"COMP+REB\", IF(ISBLANK(Data4!D43), NA(), Data4!D43), NA())","v":{"$error":"#N/A"}}]
[{"$f":"CHOOSE(DistSel,IF(ISBLANK(Data1!$A44),NA(),Data1!$A44),IF(ISBLANK(Data1!$B44),NA(),Data1!$B44))","v":{"$error":"#N/A"}},{"$f":"CHOOSE(LoadSel,IF(ISBLANK(Data1!$C44),NA(),Data1!$C44),IF(ISBLANK(Data1!$D44),NA(),Data1!$D44))","v":{"$error":"#N/A"}},{"$f":"IF(Data1!testType=\"COMP+REB\", IF(ISBLANK(Data1!D44), NA(), Data1!D44), NA())","v":{"$error":"#N/A"}},{"$f":"CHOOSE(DistSel,IF(ISBLANK(Data2!$A44),NA(),Data2!$A44),IF(ISBLANK(Data2!$B44),NA(),Data2!$B44))","v":{"$error":"#N/A"}},{"$f":"CHOOSE(LoadSel,IF(ISBLANK(Data2!$C44),NA(),Data2!$C44),IF(ISBLANK(Data2!$D44),NA(),Data2!$D44))","v":{"$error":"#N/A"}},{"$f":"IF(Data2!testType=\"COMP+REB\", IF(ISBLANK(Data2!D44), NA(), Data2!D44), NA())","v":{"$error":"#N/A"}},{"$f":"CHOOSE(DistSel,IF(ISBLANK(Data3!$A44),NA(),Data3!$A44),IF(ISBLANK(Data3!$B44),NA(),Data3!$B44))","v":{"$error":"#N/A"}},{"$f":"CHOOSE(LoadSel,IF(ISBLANK(Data3!$C44),NA(),Data3!$C44),IF(ISBLANK(Data3!$D44),NA(),Data3!$D44))","v":{"$error":"#N/A"}},{"$f":"IF(Data3!testType=\"COMP+REB\", IF(ISBLANK(Data3!D44), NA(), Data3!D44), NA())","v":{"$error":"#N/A"}},{"$f":"CHOOSE(DistSel,IF(ISBLANK(Data4!$A44),NA(),Data4!$A44),IF(ISBLANK(Data4!$B44),NA(),Data4!$B44))","v":{"$error":"#N/A"}},{"$f":"CHOOSE(LoadSel,IF(ISBLANK(Data4!$C44),NA(),Data4!$C44),IF(ISBLANK(Data4!$D44),NA(),Data4!$D44))","v":{"$error":"#N/A"}},{"$f":"IF(Data4!testType=\"COMP+REB\", IF(ISBLANK(Data4!D44), NA(), Data4!D44), NA())","v":{"$error":"#N/A"}}]
[{"$f":"CHOOSE(DistSel,IF(ISBLANK(Data1!$A45),NA(),Data1!$A45),IF(ISBLANK(Data1!$B45),NA(),Data1!$B45))","v":{"$error":"#N/A"}},{"$f":"CHOOSE(LoadSel,IF(ISBLANK(Data1!$C45),NA(),Data1!$C45),IF(ISBLANK(Data1!$D45),NA(),Data1!$D45))","v":{"$error":"#N/A"}},{"$f":"IF(Data1!testType=\"COMP+REB\", IF(ISBLANK(Data1!D45), NA(), Data1!D45), NA())","v":{"$error":"#N/A"}},{"$f":"CHOOSE(DistSel,IF(ISBLANK(Data2!$A45),NA(),Data2!$A45),IF(ISBLANK(Data2!$B45),NA(),Data2!$B45))","v":{"$error":"#N/A"}},{"$f":"CHOOSE(LoadSel,IF(ISBLANK(Data2!$C45),NA(),Data2!$C45),IF(ISBLANK(Data2!$D45),NA(),Data2!$D45))","v":{"$error":"#N/A"}},{"$f":"IF(Data2!testType=\"COMP+REB\", IF(ISBLANK(Data2!D45), NA(), Data2!D45), NA())","v":{"$error":"#N/A"}},{"$f":"CHOOSE(DistSel,IF(ISBLANK(Data3!$A45),NA(),Data3!$A45),IF(ISBLANK(Data3!$B45),NA(),Data3!$B45))","v":{"$error":"#N/A"}},{"$f":"CHOOSE(LoadSel,IF(ISBLANK(Data3!$C45),NA(),Data3!$C45),IF(ISBLANK(Data3!$D45),NA(),Data3!$D45))","v":{"$error":"#N/A"}},{"$f":"IF(Data3!testType=\"COMP+REB\", IF(ISBLANK(Data3!D45), NA(), Data3!D45), NA())","v":{"$error":"#N/A"}},{"$f":"CHOOSE(DistSel,IF(ISBLANK(Data4!$A45),NA(),Data4!$A45),IF(ISBLANK(Data4!$B45),NA(),Data4!$B45))","v":{"$error":"#N/A"}},{"$f":"CHOOSE(LoadSel,IF(ISBLANK(Data4!$C45),NA(),Data4!$C45),IF(ISBLANK(Data4!$D45),NA(),Data4!$D45))","v":{"$error":"#N/A"}},{"$f":"IF(Data4!testType=\"COMP+REB\", IF(ISBLANK(Data4!D45), NA(), Data4!D45), NA())","v":{"$error":"#N/A"}}]
[{"$f":"CHOOSE(DistSel,IF(ISBLANK(Data1!$A46),NA(),Data1!$A46),IF(ISBLANK(Data1!$B46),NA(),Data1!$B46))","v":{"$error":"#N/A"}},{"$f":"CHOOSE(LoadSel,IF(ISBLANK(Data1!$C46),NA(),Data1!$C46),IF(ISBLANK(Data1!$D46),NA(),Data1!$D46))","v":{"$error":"#N/A"}},{"$f":"IF(Data1!testType=\"COMP+REB\", IF(ISBLANK(Data1!D46), NA(), Data1!D46), NA())","v":{"$error":"#N/A"}},{"$f":"CHOOSE(DistSel,IF(ISBLANK(Data2!$A46),NA(),Data2!$A46),IF(ISBLANK(Data2!$B46),NA(),Data2!$B46))","v":{"$error":"#N/A"}},{"$f":"CHOOSE(LoadSel,IF(ISBLANK(Data2!$C46),NA(),Data2!$C46),IF(ISBLANK(Data2!$D46),NA(),Data2!$D46))","v":{"$error":"#N/A"}},{"$f":"IF(Data2!testType=\"COMP+REB\", IF(ISBLANK(Data2!D46), NA(), Data2!D46), NA())","v":{"$error":"#N/A"}},{"$f":"CHOOSE(DistSel,IF(ISBLANK(Data3!$A46),NA(),Data3!$A46),IF(ISBLANK(Data3!$B46),NA(),Data3!$B46))","v":{"$error":"#N/A"}},{"$f":"CHOOSE(LoadSel,IF(ISBLANK(Data3!$C46),NA(),Data3!$C46),IF(ISBLANK(Data3!$D46),NA(),Data3!$D46))","v":{"$error":"#N/A"}},{"$f":"IF(Data3!testType=\"COMP+REB\", IF(ISBLANK(Data3!D46), NA(), Data3!D46), NA())","v":{"$error":"#N/A"}},{"$f":"CHOOSE(DistSel,IF(ISBLANK(Data4!$A46),NA(),Data4!$A46),IF(ISBLANK(Data4!$B46),NA(),Data4!$B46))","v":{"$error":"#N/A"}},{"$f":"CHOOSE(LoadSel,IF(ISBLANK(Data4!$C46),NA(),Data4!$C46),IF(ISBLANK(Data4!$D46),NA(),Data4!$D46))","v":{"$error":"#N/A"}},{"$f":"IF(Data4!testType=\"COMP+REB\", IF(ISBLANK(Data4!D46), NA(), Data4!D46), NA())","v":{"$error":"#N/A"}}]
[{"$f":"CHOOSE(DistSel,IF(ISBLANK(Data1!$A47),NA(),Data1!$A47),IF(ISBLANK(Data1!$B47),NA(),Data1!$B47))","v":{"$error":"#N/A"}},{"$f":"CHOOSE(LoadSel,IF(ISBLANK(Data1!$C47),NA(),Data1!$C47),IF(ISBLANK(Data1!$D47),NA(),Data1!$D47))","v":{"$error":"#N/A"}},{"$f":"IF(Data1!testType=\"COMP+REB\", IF(ISBLANK(Data1!D47), NA(), Data1!D47), NA())","v":{"$error":"#N/A"}},{"$f":"CHOOSE(DistSel,IF(ISBLANK(Data2!$A47),NA(),Data2!$A47),IF(ISBLANK(Data2!$B47),NA(),Data2!$B47))","v":{"$error":"#N/A"}},{"$f":"CHOOSE(LoadSel,IF(ISBLANK(Data2!$C47),NA(),Data2!$C47),IF(ISBLANK(Data2!$D47),NA(),Data2!$D47))","v":{"$error":"#N/A"}},{"$f":"IF(Data2!testType=\"COMP+REB\", IF(ISBLANK(Data2!D47), NA(), Data2!D47), NA())","v":{"$error":"#N/A"}},{"$f":"CHOOSE(DistSel,IF(ISBLANK(Data3!$A47),NA(),Data3!$A47),IF(ISBLANK(Data3!$B47),NA(),Data3!$B47))","v":{"$error":"#N/A"}},{"$f":"CHOOSE(LoadSel,IF(ISBLANK(Data3!$C47),NA(),Data3!$C47),IF(ISBLANK(Data3!$D47),NA(),Data3!$D47))","v":{"$error":"#N/A"}},{"$f":"IF(Data3!testType=\"COMP+REB\", IF(ISBLANK(Data3!D47), NA(), Data3!D47), NA())","v":{"$error":"#N/A"}},{"$f":"CHOOSE(DistSel,IF(ISBLANK(Data4!$A47),NA(),Data4!$A47),IF(ISBLANK(Data4!$B47),NA(),Data4!$B47))","v":{"$error":"#N/A"}},{"$f":"CHOOSE(LoadSel,IF(ISBLANK(Data4!$C47),NA(),Data4!$C47),IF(ISBLANK(Data4!$D47),NA(),Data4!$D47))","v":{"$error":"#N/A"}},{"$f":"IF(Data4!testType=\"COMP+REB\", IF(ISBLANK(Data4!D47), NA(), Data4!D47), NA())","v":{"$error":"#N/A"}}]
[{"$f":"CHOOSE(DistSel,IF(ISBLANK(Data1!$A48),NA(),Data1!$A48),IF(ISBLANK(Data1!$B48),NA(),Data1!$B48))","v":{"$error":"#N/A"}},{"$f":"CHOOSE(LoadSel,IF(ISBLANK(Data1!$C48),NA(),Data1!$C48),IF(ISBLANK(Data1!$D48),NA(),Data1!$D48))","v":{"$error":"#N/A"}},{"$f":"IF(Data1!testType=\"COMP+REB\", IF(ISBLANK(Data1!D48), NA(), Data1!D48), NA())","v":{"$error":"#N/A"}},{"$f":"CHOOSE(DistSel,IF(ISBLANK(Data2!$A48),NA(),Data2!$A48),IF(ISBLANK(Data2!$B48),NA(),Data2!$B48))","v":{"$error":"#N/A"}},{"$f":"CHOOSE(LoadSel,IF(ISBLANK(Data2!$C48),NA(),Data2!$C48),IF(ISBLANK(Data2!$D48),NA(),Data2!$D48))","v":{"$error":"#N/A"}},{"$f":"IF(Data2!testType=\"COMP+REB\", IF(ISBLANK(Data2!D48), NA(), Data2!D48), NA())","v":{"$error":"#N/A"}},{"$f":"CHOOSE(DistSel,IF(ISBLANK(Data3!$A48),NA(),Data3!$A48),IF(ISBLANK(Data3!$B48),NA(),Data3!$B48))","v":{"$error":"#N/A"}},{"$f":"CHOOSE(LoadSel,IF(ISBLANK(Data3!$C48),NA(),Data3!$C48),IF(ISBLANK(Data3!$D48),NA(),Data3!$D48))","v":{"$error":"#N/A"}},{"$f":"IF(Data3!testType=\"COMP+REB\", IF(ISBLANK(Data3!D48), NA(), Data3!D48), NA())","v":{"$error":"#N/A"}},{"$f":"CHOOSE(DistSel,IF(ISBLANK(Data4!$A48),NA(),Data4!$A48),IF(ISBLANK(Data4!$B48),NA(),Data4!$B48))","v":{"$error":"#N/A"}},{"$f":"CHOOSE(LoadSel,IF(ISBLANK(Data4!$C48),NA(),Data4!$C48),IF(ISBLANK(Data4!$D48),NA(),Data4!$D48))","v":{"$error":"#N/A"}},{"$f":"IF(Data4!testType=\"COMP+REB\", IF(ISBLANK(Data4!D48), NA(), Data4!D48), NA())","v":{"$error":"#N/A"}}]
[{"$f":"CHOOSE(DistSel,IF(ISBLANK(Data1!$A49),NA(),Data1!$A49),IF(ISBLANK(Data1!$B49),NA(),Data1!$B49))","v":{"$error":"#N/A"}},{"$f":"CHOOSE(LoadSel,IF(ISBLANK(Data1!$C49),NA(),Data1!$C49),IF(ISBLANK(Data1!$D49),NA(),Data1!$D49))","v":{"$error":"#N/A"}},{"$f":"IF(Data1!testType=\"COMP+REB\", IF(ISBLANK(Data1!D49), NA(), Data1!D49), NA())","v":{"$error":"#N/A"}},{"$f":"CHOOSE(DistSel,IF(ISBLANK(Data2!$A49),NA(),Data2!$A49),IF(ISBLANK(Data2!$B49),NA(),Data2!$B49))","v":{"$error":"#N/A"}},{"$f":"CHOOSE(LoadSel,IF(ISBLANK(Data2!$C49),NA(),Data2!$C49),IF(ISBLANK(Data2!$D49),NA(),Data2!$D49))","v":{"$error":"#N/A"}},{"$f":"IF(Data2!testType=\"COMP+REB\", IF(ISBLANK(Data2!D49), NA(), Data2!D49), NA())","v":{"$error":"#N/A"}},{"$f":"CHOOSE(DistSel,IF(ISBLANK(Data3!$A49),NA(),Data3!$A49),IF(ISBLANK(Data3!$B49),NA(),Data3!$B49))","v":{"$error":"#N/A"}},{"$f":"CHOOSE(LoadSel,IF(ISBLANK(Data3!$C49),NA(),Data3!$C49),IF(ISBLANK(Data3!$D49),NA(),Data3!$D49))","v":{"$error":"#N/A"}},{"$f":"IF(Data3!testType=\"COMP+REB\", IF(ISBLANK(Data3!D49), NA(), Data3!D49), NA())","v":{"$error":"#N/A"}},{"$f":"CHOOSE(DistSel,IF(ISBLANK(Data4!$A49),NA(),Data4!$A49),IF(ISBLANK(Data4!$B49),NA(),Data4!$B49))","v":{"$error":"#N/A"}},{"$f":"CHOOSE(LoadSel,IF(ISBLANK(Data4!$C49),NA(),Data4!$C49),IF(ISBLANK(Data4!$D49),NA(),Data4!$D49))","v":{"$error":"#N/A"}},{"$f":"IF(Data4!testType=\"COMP+REB\", IF(ISBLANK(Data4!D49), NA(), Data4!D49), NA())","v":{"$error":"#N/A"}}]
[{"$f":"CHOOSE(DistSel,IF(ISBLANK(Data1!$A50),NA(),Data1!$A50),IF(ISBLANK(Data1!$B50),NA(),Data1!$B50))","v":{"$error":"#N/A"}},{"$f":"CHOOSE(LoadSel,IF(ISBLANK(Data1!$C50),NA(),Data1!$C50),IF(ISBLANK(Data1!$D50),NA(),Data1!$D50))","v":{"$error":"#N/A"}},{"$f":"IF(Data1!testType=\"COMP+REB\", IF(ISBLANK(Data1!D50), NA(), Data1!D50), NA())","v":{"$error":"#N/A"}},{"$f":"CHOOSE(DistSel,IF(ISBLANK(Data2!$A50),NA(),Data2!$A50),IF(ISBLANK(Data2!$B50),NA(),Data2!$B50))","v":{"$error":"#N/A"}},{"$f":"CHOOSE(LoadSel,IF(ISBLANK(Data2!$C50),NA(),Data2!$C50),IF(ISBLANK(Data2!$D50),NA(),Data2!$D50))","v":{"$error":"#N/A"}},{"$f":"IF(Data2!testType=\"COMP+REB\", IF(ISBLANK(Data2!D50), NA(), Data2!D50), NA())","v":{"$error":"#N/A"}},{"$f":"CHOOSE(DistSel,IF(ISBLANK(Data3!$A50),NA(),Data3!$A50),IF(ISBLANK(Data3!$B50),NA(),Data3!$B50))","v":{"$error":"#N/A"}},{"$f":"CHOOSE(LoadSel,IF(ISBLANK(Data3!$C50),NA(),Data3!$C50),IF(ISBLANK(Data3!$D50),NA(),Data3!$D50))","v":{"$error":"#N/A"}},{"$f":"IF(Data3!testType=\"COMP+REB\", IF(ISBLANK(Data3!D50), NA(), Data3!D50), NA())","v":{"$error":"#N/A"}},{"$f":"CHOOSE(DistSel,IF(ISBLANK(Data4!$A50),NA(),Data4!$A50),IF(ISBLANK(Data4!$B50),NA(),Data4!$B50))","v":{"$error":"#N/A"}},{"$f":"CHOOSE(LoadSel,IF(ISBLANK(Data4!$C50),NA(),Data4!$C50),IF(ISBLANK(Data4!$D50),NA(),Data4!$D50))","v":{"$error":"#N/A"}},{"$f":"IF(Data4!testType=\"COMP+REB\", IF(ISBLANK(Data4!D50), NA(), Data4!D50), NA())","v":{"$error":"#N/A"}}]
[{"$f":"CHOOSE(DistSel,IF(ISBLANK(Data1!$A51),NA(),Data1!$A51),IF(ISBLANK(Data1!$B51),NA(),Data1!$B51))","v":{"$error":"#N/A"}},{"$f":"CHOOSE(LoadSel,IF(ISBLANK(Data1!$C51),NA(),Data1!$C51),IF(ISBLANK(Data1!$D51),NA(),Data1!$D51))","v":{"$error":"#N/A"}},{"$f":"IF(Data1!testType=\"COMP+REB\", IF(ISBLANK(Data1!D51), NA(), Data1!D51), NA())","v":{"$error":"#N/A"}},{"$f":"CHOOSE(DistSel,IF(ISBLANK(Data2!$A51),NA(),Data2!$A51),IF(ISBLANK(Data2!$B51),NA(),Data2!$B51))","v":{"$error":"#N/A"}},{"$f":"CHOOSE(LoadSel,IF(ISBLANK(Data2!$C51),NA(),Data2!$C51),IF(ISBLANK(Data2!$D51),NA(),Data2!$D51))","v":{"$error":"#N/A"}},{"$f":"IF(Data2!testType=\"COMP+REB\", IF(ISBLANK(Data2!D51), NA(), Data2!D51), NA())","v":{"$error":"#N/A"}},{"$f":"CHOOSE(DistSel,IF(ISBLANK(Data3!$A51),NA(),Data3!$A51),IF(ISBLANK(Data3!$B51),NA(),Data3!$B51))","v":{"$error":"#N/A"}},{"$f":"CHOOSE(LoadSel,IF(ISBLANK(Data3!$C51),NA(),Data3!$C51),IF(ISBLANK(Data3!$D51),NA(),Data3!$D51))","v":{"$error":"#N/A"}},{"$f":"IF(Data3!testType=\"COMP+REB\", IF(ISBLANK(Data3!D51), NA(), Data3!D51), NA())","v":{"$error":"#N/A"}},{"$f":"CHOOSE(DistSel,IF(ISBLANK(Data4!$A51),NA(),Data4!$A51),IF(ISBLANK(Data4!$B51),NA(),Data4!$B51))","v":{"$error":"#N/A"}},{"$f":"CHOOSE(LoadSel,IF(ISBLANK(Data4!$C51),NA(),Data4!$C51),IF(ISBLANK(Data4!$D51),NA(),Data4!$D51))","v":{"$error":"#N/A"}},{"$f":"IF(Data4!testType=\"COMP+REB\", IF(ISBLANK(Data4!D51), NA(), Data4!D51), NA())","v":{"$error":"#N/A"}}]

{"sheet":"Data1","index":3,"n_rows":0,"n_cols":0,"rows_kept":0,"cut":false,"hidden":false,"merged":[]}

{"sheet":"Data2","index":4,"n_rows":0,"n_cols":0,"rows_kept":0,"cut":false,"hidden":false,"merged":[]}

{"sheet":"Data3","index":5,"n_rows":0,"n_cols":0,"rows_kept":0,"cut":false,"hidden":false,"merged":[]}

{"sheet":"Data4","index":6,"n_rows":0,"n_cols":0,"rows_kept":0,"cut":false,"hidden":false,"merged":[]}