{"text_format":"1","workbook":"xlsx","n_sheets":7,"sheets":["Overlay","DataTable","GraphData","Data1","Data2","Data3","Data4"],"not_rendered":{"charts":1,"images":1,"macros":1,"external_links":0,"defined_names":28,"comments":0,"pivot_tables":0},"unopened":[],"bounds":{"document_bytes":16777216,"sheet_cells":100000,"rows_first":2000,"rows_last":500,"rows_between":2000,"halvings":0,"cell_chars":16384,"cell_head_chars":4096},"cells_cut":0,"cells_raw":0,"read":"whole","date_system":"1900"}

{"sheet":"Overlay","index":0,"n_rows":16,"n_cols":4,"rows_kept":16,"cut":false,"hidden":false,"merged":[[7,1,7,4],[13,0,13,1],[13,2,13,4],[14,0,14,4],[8,2,8,4],[9,2,9,4],[10,2,10,4],[11,2,11,4],[2,1,2,4],[1,1,1,4],[4,3,4,4],[5,3,5,4],[4,1,4,2],[5,1,5,2]]}
[]
[null,"TOUCHSCREEN MODEL"]
[null,"GRAPH OVERLAY"]
[]
[null,"Distance - X",null,"Load - Y"]
[]
[]
[null,"LEGEND"]
[null,"1    ¯",{"$f":"TestName1","v":""}]
[null,"2 o",{"$f":"TestName2","v":""}]
{"$rows_left_out":7}
{"sheet":"DataTable","index":1,"n_rows":54,"n_cols":20,"rows_kept":54,"cut":false,"hidden":false,"merged":[[1,17,1,19],[1,2,1,4],[1,7,1,9],[1,12,1,14]]}
[""]
[null,"¯","",null,null,null,"o","",null,null,null,"¡","",null,null,null,"r",""]
[null,"Center","Travel",{"$f":"IF(Data1!testType=\"COMP+REB\", \"Up\", \"Wheel\")","v":"Wheel"},{"$f":"IF(Data1!testType=\"COMP+REB\", \"Down\", \"Offset\")","v":"Offset"},null,"Center","Travel",{"$f":"IF(Data2!testType=\"COMP+REB\", \"Up\", \"Wheel\")","v":"Wheel"},{"$f":"IF(Data2!testType=\"COMP+REB\", \"Down\", \"Offset\")","v":"Offset"},null,"Center","Travel",{"$f":"IF(Data3!testType=\"COMP+REB\", \"Up\", \"Wheel\")","v":"Wheel"},{"$f":"IF(Data3!testType=\"COMP+REB\", \"Down\", \"Offset\")","v":"Offset"},null,"Center","Travel",{"$f":"IF(Data4!testType=\"COMP+REB\", \"Up\", \"Wheel\")","v":"Wheel"},{"$f":"IF(Data4!testType=\"COMP+REB\", \"Down\", \"Offset\")","v":"Offset"}]
[null,"Distance","Distance","Load","Load",null,"Distance","Distance","Load","Load",null,"Distance","Distance","Load","Load",null,"Distance","Distance","Load","Load"]
[1,{"$f":"IF(ISBLANK(Data1!$A2),\"\",Data1!$A2)","v":""},{"$f":"IF(ISBLANK(Data1!$B2),\"\",Data1!$B2)","v":""},{"$f":"IF(ISBLANK(Data1!$C2),\"\",Data1!$C2)","v":""},{"$f":"IF(ISBLANK(Data1!$D2),\"\",Data1!$D2)","v":""},null,{"$f":"IF(ISBLANK(Data2!$A2),\"\",Data2!$A2)","v":""},{"$f":"IF(ISBLANK(Data2!$B2),\"\",Data2!$B2)","v":""},{"$f":"IF(ISBLANK(Data2!$C2),\"\",Data2!$C2)","v":""},{"$f":"IF(ISBLANK(Data2!$D2),\"\",Data2!$D2)","v":""},null,{"$f":"IF(ISBLANK(Data3!$A2),\"\",Data3!$A2)","v":""},{"$f":"IF(ISBLANK(Data3!$B2),\"\",Data3!$B2)","v":""},{"$f":"IF(ISBLANK(Data3!$C2),\"\",Data3!$C2)","v":""},{"$f":"IF(ISBLANK(Data3!$D2),\"\",Data3!$D2)","v":""},null,{"$f":"IF(ISBLANK(Data4!$A2),\"\",Data4!$A2)","v":""},{"$f":"IF(ISBLANK(Data4!$B2),\"\",Data4!$B2)","v":""},{"$f":"IF(ISBLANK(Data4!$C2),\"\",Data4!$C2)","v":""},{"$f":"IF(ISBLANK(Data4!$D2),\"\",Data4!$D2)","v":""}]
[{"$f":"A5+1","v":2},{"$f":"IF(ISBLANK(Data1!$A3),\"\",Data1!$A3)","v":""},{"$f":"IF(ISBLANK(Data1!$B3),\"\",Data1!$B3)","v":""},{"$f":"IF(ISBLANK(Data1!$C3),\"\",Data1!$C3)","v":""},{"$f":"IF(ISBLANK(Data1!$D3),\"\",Data1!$D3)","v":""},null,{"$f":"IF(ISBLANK(Data2!$A3),\"\",Data2!$A3)","v":""},{"$f":"IF(ISBLANK(Data2!$B3),\"\",Data2!$B3)","v":""},{"$f":"IF(ISBLANK(Data2!$C3),\"\",Data2!$C3)","v":""},{"$f":"IF(ISBLANK(Data2!$D3),\"\",Data2!$D3)","v":""},null,{"$f":"IF(ISBLANK(Data3!$A3),\"\",Data3!$A3)","v":""},{"$f":"IF(ISBLANK(Data3!$B3),\"\",Data3!$B3)","v":""},{"$f":"IF(ISBLANK(Data3!$C3),\"\",Data3!$C3)","v":""},{"$f":"IF(ISBLANK(Data3!$D3),\"\",Data3!$D3)","v":""},null,{"$f":"IF(ISBLANK(Data4!$A3),\"\",Data4!$A3)","v":""},{"$f":"IF(ISBLANK(Data4!$B3),\"\",Data4!$B3)","v":""},{"$f":"IF(ISBLANK(Data4!$C3),\"\",Data4!$C3)","v":""},{"$f":"IF(ISBLANK(Data4!$D3),\"\",Data4!$D3)","v":""}]
[3,{"$f":"IF(ISBLANK(Data1!$A4),\"\",Data1!$A4)","v":""},{"$f":"IF(ISBLANK(Data1!$B4),\"\",Data1!$B4)","v":""},{"$f":"IF(ISBLANK(Data1!$C4),\"\",Data1!$C4)","v":""},{"$f":"IF(ISBLANK(Data1!$D4),\"\",Data1!$D4)","v":""},null,{"$f":"IF(ISBLANK(Data2!$A4),\"\",Data2!$A4)","v":""},{"$f":"IF(ISBLANK(Data2!$B4),\"\",Data2!$B4)","v":""},{"$f":"IF(ISBLANK(Data2!$C4),\"\",Data2!$C4)","v":""},{"$f":"IF(ISBLANK(Data2!$D4),\"\",Data2!$D4)","v":""},null,{"$f":"IF(ISBLANK(Data3!$A4),\"\",Data3!$A4)","v":""},{"$f":"IF(ISBLANK(Data3!$B4),\"\",Data3!$B4)","v":""},{"$f":"IF(ISBLANK(Data3!$C4),\"\",Data3!$C4)","v":""},{"$f":"IF(ISBLANK(Data3!$D4),\"\",Data3!$D4)","v":""},null,{"$f":"IF(ISBLANK(Data4!$A4),\"\",Data4!$A4)","v":""},{"$f":"IF(ISBLANK(Data4!$B4),\"\",Data4!$B4)","v":""},{"$f":"IF(ISBLANK(Data4!$C4),\"\",Data4!$C4)","v":""},{"$f":"IF(ISBLANK(Data4!$D4),\"\",Data4!$D4)","v":""}]
[4,{"$f":"IF(ISBLANK(Data1!$A5),\"\",Data1!$A5)","v":""},{"$f":"IF(ISBLANK(Data1!$B5),\"\",Data1!$B5)","v":""},{"$f":"IF(ISBLANK(Data1!$C5),\"\",Data1!$C5)","v":""},{"$f":"IF(ISBLANK(Data1!$D5),\"\",Data1!$D5)","v":""},null,{"$f":"IF(ISBLANK(Data2!$A5),\"\",Data2!$A5)","v":""},{"$f":"IF(ISBLANK(Data2!$B5),\"\",Data2!$B5)","v":""},{"$f":"IF(ISBLANK(Data2!$C5),\"\",Data2!$C5)","v":""},{"$f":"IF(ISBLANK(Data2!$D5),\"\",Data2!$D5)","v":""},null,{"$f":"IF(ISBLANK(Data3!$A5),\"\",Data3!$A5)","v":""},{"$f":"IF(ISBLANK(Data3!$B5),\"\",Data3!$B5)","v":""},{"$f":"IF(ISBLANK(Data3!$C5),\"\",Data3!$C5)","v":""},{"$f":"IF(ISBLANK(Data3!$D5),\"\",Data3!$D5)","v":""},null,{"$f":"IF(ISBLANK(Data4!$A5),\"\",Data4!$A5)","v":""},{"$f":"IF(ISBLANK(Data4!$B5),\"\",Data4!$B5)","v":""},{"$f":"IF(ISBLANK(Data4!$C5),\"\",Data4!$C5)","v":""},{"$f":"IF(ISBLANK(Data4!$D5),\"\",Data4!$D5)","v":""}]
[5,{"$f":"IF(ISBLANK(Data1!$A6),\"\",Data1!$A6)","v":""},{"$f":"IF(ISBLANK(Data1!$B6),\"\",Data1!$B6)","v":""},{"$f":"IF(ISBLANK(Data1!$C6),\"\",Data1!$C6)","v":""},{"$f":"IF(ISBLANK(Data1!$D6),\"\",Data1!$D6)","v":""},null,{"$f":"IF(ISBLANK(Data2!$A6),\"\",Data2!$A6)","v":""},{"$f":"IF(ISBLANK(Data2!$B6),\"\",Data2!$B6)","v":""},{"$f":"IF(ISBLANK(Data2!$C6),\"\",Data2!$C6)","v":""},{"$f":"IF(ISBLANK(Data2!$D6),\"\",Data2!$D6)","v":""},null,{"$f":"IF(ISBLANK(Data3!$A6),\"\",Data3!$A6)","v":""},{"$f":"IF(ISBLANK(Data3!$B6),\"\",Data3!$B6)","v":""},{"$f":"IF(ISBLANK(Data3!$C6),\"\",Data3!$C6)","v":""},{"$f":"IF(ISBLANK(Data3!$D6),\"\",Data3!$D6)","v":""},null,{"$f":"IF(ISBLANK(Data4!$A6),\"\",Data4!$A6)","v":""},{"$f":"IF(ISBLANK(Data4!$B6),\"\",Data4!$B6)","v":""},{"$f":"IF(ISBLANK(Data4!$C6),\"\",Data4!$C6)","v":""},{"$f":"IF(ISBLANK(Data4!$D6),\"\",Data4!$D6)","v":""}]
[6,{"$f":"IF(ISBLANK(Data1!$A7),\"\",Data1!$A7)","v":""},{"$f":"IF(ISBLANK(Data1!$B7),\"\",Data1!$B7)","v":""},{"$f":"IF(ISBLANK(Data1!$C7),\"\",Data1!$C7)","v":""},{"$f":"IF(ISBLANK(Data1!$D7),\"\",Data1!$D7)","v":""},null,{"$f":"IF(ISBLANK(Data2!$A7),\"\",Data2!$A7)","v":""},{"$f":"IF(ISBLANK(Data2!$B7),\"\",Data2!$B7)","v":""},{"$f":"IF(ISBLANK(Data2!$C7),\"\",Data2!$C7)","v":""},{"$f":"IF(ISBLANK(Data2!$D7),\"\",Data2!$D7)","v":""},null,{"$f":"IF(ISBLANK(Data3!$A7),\"\",Data3!$A7)","v":""},{"$f":"IF(ISBLANK(Data3!$B7),\"\",Data3!$B7)","v":""},{"$f":"IF(ISBLANK(Data3!$C7),\"\",Data3!$C7)","v":""},{"$f":"IF(ISBLANK(Data3!$D7),\"\",Data3!$D7)","v":""},null,{"$f":"IF(ISBLANK(Data4!$A7),\"\",Data4!$A7)","v":""},{"$f":"IF(ISBLANK(Data4!$B7),\"\",Data4!$B7)","v":""},{"$f":"IF(ISBLANK(Data4!$C7),\"\",Data4!$C7)","v":""},{"$f":"IF(ISBLANK(Data4!$D7),\"\",Data4!$D7)","v":""}]
{"$rows_left_out":45}
{"sheet":"GraphData","index":2,"n_rows":55,"n_cols":12,"rows_kept":55,"cut":false,"hidden":false,"merged":[[3,0,3,2],[3,3,3,5],[3,6,3,8],[3,9,3,11]]}
["DistSel",1,null,"testType",{"$f":"IF(OR(Data1!testType=\"COMP+REB\", Data2!testType=\"COMP+REB\", Data3!testType=\"COMP+REB\", Data4!testType=\"COMP+REB\"), \"COMP+REB\", \"COMP_ONLY\")","v":"COMP_ONLY"}]
["LoadSel",1,null,"units",{"$f":"IF(OR(Data1!units=\"MET\", Data2!units=\"MET\", Data3!units=\"MET\", Data4!units=\"MET\"), \"MET\", \"ENG\")","v":"ENG"}]
[]
["DATA1",null,null,"DATA2",null,null,"DATA3",null,null,"DATA4"]
["Distance (X)","Load (Y)","Rebound","Distance (X)","Load (Y)","Rebound","Distance (X)","Load (Y)","Rebound","Distance (X)","Load (Y)","Rebound"]
[{"$f":"CHOOSE(DistSel,IF(ISBLANK(Data1!$A2),NA(),Data1!$A2),IF(ISBLANK(Data1!$B2),NA(),Data1!$B2))","v":{"$error":"#N/A"}},{"$f":"CHOOSE(LoadSel,IF(ISBLANK(Data1!$C2),NA(),Data1!$C2),IF(ISBLANK(Data1!$D2),NA(),Data1!$D2))","v":{"$error":"#N/A"}},{"$f":"IF(Data1!testType=\"COMP+REB\", IF(ISBLANK(Data1!D2), NA(), Data1!D2), NA())","v":{"$error":"#N/A"}},{"$f":"CHOOSE(DistSel,IF(ISBLANK(Data2!$A2),NA(),Data2!$A2),IF(ISBLANK(Data2!$B2),NA(),Data2!$B2))","v":{"$error":"#N/A"}},{"$f":"CHOOSE(LoadSel,IF(ISBLANK(Data2!$C2),NA(),Data2!$C2),IF(ISBLANK(Data2!$D2),NA(),Data2!$D2))","v":{"$error":"#N/A"}},{"$f":"IF(Data2!testType=\"COMP+REB\", IF(ISBLANK(Data2!D2), NA(), Data2!D2), NA())","v":{"$error":"#N/A"}},{"$f":"CHOOSE(DistSel,IF(ISBLANK(Data3!$A2),NA(),Data3!$A2),IF(ISBLANK(Data3!$B2),NA(),Data3!$B2))","v":{"$error":"#N/A"}},{"$f":"CHOOSE(LoadSel,IF(ISBLANK(Data3!$C2),NA(),Data3!$C2),IF(ISBLANK(Data3!$D2),NA(),Data3!$D2))","v":{"$error":"#N/A"}},{"$f":"IF(Data3!testType=\"COMP+REB\", IF(ISBLANK(Data3!D2), NA(), Data3!D2), NA())","v":{"$error":"#N/A"}},{"$f":"CHOOSE(DistSel,IF(ISBLANK(Data4!$A2),NA(),Data4!$A2),IF(ISBLANK(Data4!$B2),NA(),Data4!$B2))","v":{"$error":"#N/A"}},{"$f":"CHOOSE(LoadSel,IF(ISBLANK(Data4!$C2),NA(),Data4!$C2),IF(ISBLANK(Data4!$D2),NA(),Data4!$D2))","v":{"$error":"#N/A"}},{"$f":"IF(Data4!testType=\"COMP+REB\", IF(ISBLANK(Data4!D2), NA(), Data4!D2), NA())","v":{"$error":"#N/A"}}]
[{"$f":"CHOOSE(DistSel,IF(ISBLANK(Data1!$A3),NA(),Data1!$A3),IF(ISBLANK(Data1!$B3),NA(),Data1!$B3))","v":{"$error":"#N/A"}},{"$f":"CHOOSE(LoadSel,IF(ISBLANK(Data1!$C3),NA(),Data1!$C3),IF(ISBLANK(Data1!$D3),NA(),Data1!$D3))","v":{"$error":"#N/A"}},{"$f":"IF(Data1!testType=\"COMP+REB\", IF(ISBLANK(Data1!D3), NA(), Data1!D3), NA())","v":{"$error":"#N/A"}},{"$f":"CHOOSE(DistSel,IF(ISBLANK(Data2!$A3),NA(),Data2!$A3),IF(ISBLANK(Data2!$B3),NA(),Data2!$B3))","v":{"$error":"#N/A"}},{"$f":"CHOOSE(LoadSel,IF(ISBLANK(Data2!$C3),NA(),Data2!$C3),IF(ISBLANK(Data2!$D3),NA(),Data2!$D3))","v":{"$error":"#N/A"}},{"$f":"IF(Data2!testType=\"COMP+REB\", IF(ISBLANK(Data2!D3), NA(), Data2!D3), NA())","v":{"$error":"#N/A"}},{"$f":"CHOOSE(DistSel,IF(ISBLANK(Data3!$A3),NA(),Data3!$A3),IF(ISBLANK(Data3!$B3),NA(),Data3!$B3))","v":{"$error":"#N/A"}},{"$f":"CHOOSE(LoadSel,IF(ISBLANK(Data3!$C3),NA(),Data3!$C3),IF(ISBLANK(Data3!$D3),NA(),Data3!$D3))","v":{"$error":"#N/A"}},{"$f":"IF(Data3!testType=\"COMP+REB\", IF(ISBLANK(Data3!D3), NA(), Data3!D3), NA())","v":{"$error":"#N/A"}},{"$f":"CHOOSE(DistSel,IF(ISBLANK(Data4!$A3),NA(),Data4!$A3),IF(ISBLANK(Data4!$B3),NA(),Data4!$B3))","v":{"$error":"#N/A"}},{"$f":"CHOOSE(LoadSel,IF(ISBLANK(Data4!$C3),NA(),Data4!$C3),IF(ISBLANK(Data4!$D3),NA(),Data4!$D3))","v":{"$error":"#N/A"}},{"$f":"IF(Data4!testType=\"COMP+REB\", IF(ISBLANK(Data4!D3), NA(), Data4!D3), NA())","v":{"$error":"#N/A"}}]
[{"$f":"CHOOSE(DistSel,IF(ISBLANK(Data1!$A4),NA(),Data1!$A4),IF(ISBLANK(Data1!$B4),NA(),Data1!$B4))","v":{"$error":"#N/A"}},{"$f":"CHOOSE(LoadSel,IF(ISBLANK(Data1!$C4),NA(),Data1!$C4),IF(ISBLANK(Data1!$D4),NA(),Data1!$D4))","v":{"$error":"#N/A"}},{"$f":"IF(Data1!testType=\"COMP+REB\", IF(ISBLANK(Data1!D4), NA(), Data1!D4), NA())","v":{"$error":"#N/A"}},{"$f":"CHOOSE(DistSel,IF(ISBLANK(Data2!$A4),NA(),Data2!$A4),IF(ISBLANK(Data2!$B4),NA(),Data2!$B4))","v":{"$error":"#N/A"}},{"$f":"CHOOSE(LoadSel,IF(ISBLANK(Data2!$C4),NA(),Data2!$C4),IF(ISBLANK(Data2!$D4),NA(),Data2!$D4))","v":{"$error":"#N/A"}},{"$f":"IF(Data2!testType=\"COMP+REB\", IF(ISBLANK(Data2!D4), NA(), Data2!D4), NA())","v":{"$error":"#N/A"}},{"$f":"CHOOSE(DistSel,IF(ISBLANK(Data3!$A4),NA(),Data3!$A4),IF(ISBLANK(Data3!$B4),NA(),Data3!$B4))","v":{"$error":"#N/A"}},{"$f":"CHOOSE(LoadSel,IF(ISBLANK(Data3!$C4),NA(),Data3!$C4),IF(ISBLANK(Data3!$D4),NA(),Data3!$D4))","v":{"$error":"#N/A"}},{"$f":"IF(Data3!testType=\"COMP+REB\", IF(ISBLANK(Data3!D4), NA(), Data3!D4), NA())","v":{"$error":"#N/A"}},{"$f":"CHOOSE(DistSel,IF(ISBLANK(Data4!$A4),NA(),Data4!$A4),IF(ISBLANK(Data4!$B4),NA(),Data4!$B4))","v":{"$error":"#N/A"}},{"$f":"CHOOSE(LoadSel,IF(ISBLANK(Data4!$C4),NA(),Data4!$C4),IF(ISBLANK(Data4!$D4),NA(),Data4!$D4))","v":{"$error":"#N/A"}},{"$f":"IF(Data4!testType=\"COMP+REB\", IF(ISBLANK(Data4!D4), NA(), Data4!D4), NA())","v":{"$error":"#N/A"}}]
[{"$f":"CHOOSE(DistSel,IF(ISBLANK(Data1!$A5),NA(),Data1!$A5),IF(ISBLANK(Data1!$B5),NA(),Data1!$B5))","v":{"$error":"#N/A"}},{"$f":"CHOOSE(LoadSel,IF(ISBLANK(Data1!$C5),NA(),Data1!$C5),IF(ISBLANK(Data1!$D5),NA(),Data1!$D5))","v":{"$error":"#N/A"}},{"$f":"IF(Data1!testType=\"COMP+REB\", IF(ISBLANK(Data1!D5), NA(), Data1!D5), NA())","v":{"$error":"#N/A"}},{"$f":"CHOOSE(DistSel,IF(ISBLANK(Data2!$A5),NA(),Data2!$A5),IF(ISBLANK(Data2!$B5),NA(),Data2!$B5))","v":{"$error":"#N/A"}},{"$f":"CHOOSE(LoadSel,IF(ISBLANK(Data2!$C5),NA(),Data2!$C5),IF(ISBLANK(Data2!$D5),NA(),Data2!$D5))","v":{"$error":"#N/A"}},{"$f":"IF(Data2!testType=\"COMP+REB\", IF(ISBLANK(Data2!D5), NA(), Data2!D5), NA())","v":{"$error":"#N/A"}},{"$f":"CHOOSE(DistSel,IF(ISBLANK(Data3!$A5),NA(),Data3!$A5),IF(ISBLANK(Data3!$B5),NA(),Data3!$B5))","v":{"$error":"#N/A"}},{"$f":"CHOOSE(LoadSel,IF(ISBLANK(Data3!$C5),NA(),Data3!$C5),IF(ISBLANK(Data3!$D5),NA(),Data3!$D5))","v":{"$error":"#N/A"}},{"$f":"IF(Data3!testType=\"COMP+REB\", IF(ISBLANK(Data3!D5), NA(), Data3!D5), NA())","v":{"$error":"#N/A"}},{"$f":"CHOOSE(DistSel,IF(ISBLANK(Data4!$A5),NA(),Data4!$A5),IF(ISBLANK(Data4!$B5),NA(),Data4!$B5))","v":{"$error":"#N/A"}},{"$f":"CHOOSE(LoadSel,IF(ISBLANK(Data4!$C5),NA(),Data4!$C5),IF(ISBLANK(Data4!$D5),NA(),Data4!$D5))","v":{"$error":"#N/A"}},{"$f":"IF(Data4!testType=\"COMP+REB\", IF(ISBLANK(Data4!D5), NA(), Data4!D5), NA())","v":{"$error":"#N/A"}}]
[{"$f":"CHOOSE(DistSel,IF(ISBLANK(Data1!$A6),NA(),Data1!$A6),IF(ISBLANK(Data1!$B6),NA(),Data1!$B6))","v":{"$error":"#N/A"}},{"$f":"CHOOSE(LoadSel,IF(ISBLANK(Data1!$C6),NA(),Data1!$C6),IF(ISBLANK(Data1!$D6),NA(),Data1!$D6))","v":{"$error":"#N/A"}},{"$f":"IF(Data1!testType=\"COMP+REB\", IF(ISBLANK(Data1!D6), NA(), Data1!D6), NA())","v":{"$error":"#N/A"}},{"$f":"CHOOSE(DistSel,IF(ISBLANK(Data2!$A6),NA(),Data2!$A6),IF(ISBLANK(Data2!$B6),NA(),Data2!$B6))","v":{"$error":"#N/A"}},{"$f":"CHOOSE(LoadSel,IF(ISBLANK(Data2!$C6),NA(),Data2!$C6),IF(ISBLANK(Data2!$D6),NA(),Data2!$D6))","v":{"$error":"#N/A"}},{"$f":"IF(Data2!testType=\"COMP+REB\", IF(ISBLANK(Data2!D6), NA(), Data2!D6), NA())","v":{"$error":"#N/A"}},{"$f":"CHOOSE(DistSel,IF(ISBLANK(Data3!$A6),NA(),Data3!$A6),IF(ISBLANK(Data3!$B6),NA(),Data3!$B6))","v":{"$error":"#N/A"}},{"$f":"CHOOSE(LoadSel,IF(ISBLANK(Data3!$C6),NA(),Data3!$C6),IF(ISBLANK(Data3!$D6),NA(),Data3!$D6))","v":{"$error":"#N/A"}},{"$f":"IF(Data3!testType=\"COMP+REB\", IF(ISBLANK(Data3!D6), NA(), Data3!D6), NA())","v":{"$error":"#N/A"}},{"$f":"CHOOSE(DistSel,IF(ISBLANK(Data4!$A6),NA(),Data4!$A6),IF(ISBLANK(Data4!$B6),NA(),Data4!$B6))","v":{"$error":"#N/A"}},{"$f":"CHOOSE(LoadSel,IF(ISBLANK(Data4!$C6),NA(),Data4!$C6),IF(ISBLANK(Data4!$D6),NA(),Data4!$D6))","v":{"$error":"#N/A"}},{"$f":"IF(Data4!testType=\"COMP+REB\", IF(ISBLANK(Data4!D6), NA(), Data4!D6), NA())","v":{"$error":"#N/A"}}]
{"$rows_left_out":46}
{"sheet":"Data1","index":3,"n_rows":0,"n_cols":0,"rows_kept":0,"cut":false,"hidden":false,"merged":[]}

{"sheet":"Data2","index":4,"n_rows":0,"n_cols":0,"rows_kept":0,"cut":false,"hidden":false,"merged":[]}

{"sheet":"Data3","index":5,"n_rows":0,"n_cols":0,"rows_kept":0,"cut":false,"hidden":false,"merged":[]}

{"sheet":"Data4","index":6,"n_rows":0,"n_cols":0,"rows_kept":0,"cut":false,"hidden":false,"merged":[]}